BDBM50169915 2-(4-Chloro-phenyl)-3-cyclohexyl-1-[2-(1,1-dioxo-1lambda*6*-thiomorpholin-4-yl)-2-oxo-ethyl]-1H-indole-6-carboxylic acid::CHEMBL363566
SMILES: OC(=O)c1ccc2c(C3CCCCC3)c(-c3ccc(Cl)cc3)n(CC(=O)N3CCS(=O)(=O)CC3)c2c1
InChI Key: InChIKey=KBRMMPNHNZOTJS-UHFFFAOYSA-N
Data: 1 IC50
Activity Spreadsheet -- Enzyme Inhibition Constant Data from BindingDB
Found 1 hit for monomerid = 50169915
Trg + Lig
Ki
nM
ΔG°
kcal/mole
IC50
nM
Kd
nM
EC50/IC50
nM
koff
s-1
kon
M-1s-1
pHTemp
°C
Hepatitis C virus NS5B RNA-dependent RNA polymerase
(Hepatitis C virus)
BDBM50169915
(2-(4-Chloro-phenyl)-3-cyclohexyl-1-[2-(1,1-dioxo-1...)
Show SMILES OC(=O)c1ccc2c(C3CCCCC3)c(-c3ccc(Cl)cc3)n(CC(=O)N3CCS(=O)(=O)CC3)c2c1
Show InChI InChI=1S/C27H29ClN2O5S/c28-21-9-6-19(7-10-21)26-25(18-4-2-1-3-5-18)22-11-8-20(27(32)33)16-23(22)30(26)17-24(31)29-12-14-36(34,35)15-13-29/h6-11,16,18H,1-5,12-15,17H2,(H,32,33)
n/an/a 11n/an/an/an/an/an/a
IRBM (Merck Research Laboratories
Curated by ChEMBL
Assay Description
Inhibitory activity against by hepatitis C virus NS5B polymerase
J Med Chem 48: 4547-57 (2005)
Article DOI: 10.1021/jm050056+
BindingDB Entry DOI: 10.7270/Q24B30VN