BDBM50169919 2-(4-Chloro-phenyl)-3-cyclohexyl-1-[2-(4-dimethylamino-pyrrolidin-2-yl)-2-oxo-ethyl]-1H-indole-6-carboxylic acid::CHEMBL443044
SMILES: CN(C)C1CNC(C1)C(=O)Cn1c(c(C2CCCCC2)c2ccc(cc12)C(O)=O)-c1ccc(Cl)cc1
InChI Key: InChIKey=NVFAYGFBOQLQLC-UHFFFAOYSA-N
Data: 1 IC50
Activity Spreadsheet -- Enzyme Inhibition Constant Data from BindingDB
Found 1 hit for monomerid = 50169919
Trg + Lig
Ki
nM
ΔG°
kcal/mole
IC50
nM
Kd
nM
EC50/IC50
nM
koff
s-1
kon
M-1s-1
pHTemp
°C
Hepatitis C virus NS5B RNA-dependent RNA polymerase
(Hepatitis C virus)
BDBM50169919
(2-(4-Chloro-phenyl)-3-cyclohexyl-1-[2-(4-dimethyla...)
Show SMILES CN(C)C1CNC(C1)C(=O)Cn1c(c(C2CCCCC2)c2ccc(cc12)C(O)=O)-c1ccc(Cl)cc1
Show InChI InChI=1S/C29H34ClN3O3/c1-32(2)22-15-24(31-16-22)26(34)17-33-25-14-20(29(35)36)10-13-23(25)27(18-6-4-3-5-7-18)28(33)19-8-11-21(30)12-9-19/h8-14,18,22,24,31H,3-7,15-17H2,1-2H3,(H,35,36)
n/an/a 13n/an/an/an/an/an/a
IRBM (Merck Research Laboratories
Curated by ChEMBL
Assay Description
Inhibitory activity against by hepatitis C virus NS5B polymerase
J Med Chem 48: 4547-57 (2005)
Article DOI: 10.1021/jm050056+
BindingDB Entry DOI: 10.7270/Q24B30VN