BDBM50169946 3-Cyclohexyl-1-[(isopropyl-methyl-carbamoyl)-methyl]-2-phenyl-1H-indole-6-carboxylic acid::CHEMBL191446
SMILES: CC(C)N(C)C(=O)Cn1c(c(C2CCCCC2)c2ccc(cc12)C(O)=O)-c1ccccc1
InChI Key: InChIKey=NXFKRXRDCGXBNM-UHFFFAOYSA-N
Data: 1 IC50
Activity Spreadsheet -- Enzyme Inhibition Constant Data from BindingDB
Found 1 hit for monomerid = 50169946
Trg + Lig
Ki
nM
ΔG°
kcal/mole
IC50
nM
Kd
nM
EC50/IC50
nM
koff
s-1
kon
M-1s-1
pHTemp
°C
Hepatitis C virus NS5B RNA-dependent RNA polymerase
(Hepatitis C virus)
BDBM50169946
(3-Cyclohexyl-1-[(isopropyl-methyl-carbamoyl)-methy...)
Show SMILES CC(C)N(C)C(=O)Cn1c(c(C2CCCCC2)c2ccc(cc12)C(O)=O)-c1ccccc1
Show InChI InChI=1S/C27H32N2O3/c1-18(2)28(3)24(30)17-29-23-16-21(27(31)32)14-15-22(23)25(19-10-6-4-7-11-19)26(29)20-12-8-5-9-13-20/h5,8-9,12-16,18-19H,4,6-7,10-11,17H2,1-3H3,(H,31,32)
n/an/a 62n/an/an/an/an/an/a
IRBM (Merck Research Laboratories
Curated by ChEMBL
Assay Description
Inhibitory activity against by hepatitis C virus NS5B polymerase
J Med Chem 48: 4547-57 (2005)
Article DOI: 10.1021/jm050056+
BindingDB Entry DOI: 10.7270/Q24B30VN