BDBM50169970 (2Z)-1,3-benzothiazol-2(3H)-ylidene[2-(methylamino)pyrimidin-4-yl]acetonitrile::CHEMBL370477
SMILES: CNc1nccc(n1)C(C#N)c1nc2ccccc2s1
InChI Key: InChIKey=ODCLSTIOISSVGF-UHFFFAOYSA-N
Data: 1 IC50
Activity Spreadsheet -- Enzyme Inhibition Constant Data from BindingDB
Found 1 hit for monomerid = 50169970
Trg + Lig
Ki
nM
ΔG°
kcal/mole
IC50
nM
Kd
nM
EC50/IC50
nM
koff
s-1
kon
M-1s-1
pHTemp
°C
c-Jun N-terminal kinase 3
(Rattus norvegicus)
BDBM50169970
((2Z)-1,3-benzothiazol-2(3H)-ylidene[2-(methylamino...)
Show SMILES CNc1nccc(n1)C(C#N)c1nc2ccccc2s1
Show InChI InChI=1S/C14H11N5S/c1-16-14-17-7-6-10(19-14)9(8-15)13-18-11-4-2-3-5-12(11)20-13/h2-7,9H,1H3,(H,16,17,19)
n/an/a 950n/an/an/an/an/an/a
Serono Pharmaceutical Research Institute
Curated by ChEMBL
Assay Description
Inhibition of rat c-Jun N-terminal kinase 3
J Med Chem 48: 4596-607 (2005)
Article DOI: 10.1021/jm0310986
BindingDB Entry DOI: 10.7270/Q2K9389G