BDBM50170182 3,4-Dichloro-N-[4-(4-dimethylamino-quinazolin-2-ylamino)-cyclohexyl]-benzamide::CHEMBL362400
SMILES: CN(C)c1nc(N[C@@H]2CC[C@@H](CC2)NC(=O)c2ccc(Cl)c(Cl)c2)nc2ccccc12
InChI Key: InChIKey=UGUPGQUFTPDBTH-IYBDPMFKSA-N
Data: 2 IC50
Activity Spreadsheet -- Enzyme Inhibition Constant Data from BindingDB
Found 2 hits for monomerid = 50170182
Trg + Lig
Ki
nM
ΔG°
kcal/mole
IC50
nM
Kd
nM
EC50/IC50
nM
koff
s-1
kon
M-1s-1
pHTemp
°C
Melanin-concentrating hormone receptor
(Homo sapiens (Human))
BDBM50170182
(3,4-Dichloro-N-[4-(4-dimethylamino-quinazolin-2-yl...)
Show SMILES CN(C)c1nc(N[C@@H]2CC[C@@H](CC2)NC(=O)c2ccc(Cl)c(Cl)c2)nc2ccccc12 |wU:10.13,7.6,(-2.35,4.13,;-3.68,3.35,;-5.01,4.12,;-3.68,1.81,;-2.33,1.05,;-2.33,-.5,;-1,-1.24,;.35,-.49,;1.69,-1.27,;3.02,-.5,;3.02,1.04,;1.68,1.81,;.33,1.04,;4.35,1.81,;5.68,1.04,;5.68,-.5,;7.01,1.81,;8.35,1.04,;9.68,1.81,;9.68,3.35,;11.01,4.12,;8.34,4.12,;8.34,5.66,;7.01,3.35,;-3.66,-1.27,;-4.99,-.5,;-6.32,-1.28,;-7.65,-.51,;-7.65,1.03,;-6.32,1.81,;-4.99,1.04,)|
Show InChI InChI=1S/C23H25Cl2N5O/c1-30(2)21-17-5-3-4-6-20(17)28-23(29-21)27-16-10-8-15(9-11-16)26-22(31)14-7-12-18(24)19(25)13-14/h3-7,12-13,15-16H,8-11H2,1-2H3,(H,26,31)(H,27,28,29)/t15-,16+
Reactome pathway
n/an/a 5n/an/an/an/an/an/a
Taisho Pharmaceutical Co. Ltd.
Curated by ChEMBL
Assay Description
Inhibitory activity against human CA-MCH-R1 (Melanin-concentrating hormone receptor 1) by using [125I](Phe13,Tyr19)MCH as radioligand expressed in HE...
Bioorg Med Chem Lett 15: 3853-6 (2005)
Article DOI: 10.1016/j.bmcl.2005.05.121
BindingDB Entry DOI: 10.7270/Q23R0TM4
Alpha-2A adrenergic receptor
(Homo sapiens (Human))
BDBM50170182
(3,4-Dichloro-N-[4-(4-dimethylamino-quinazolin-2-yl...)
Show SMILES CN(C)c1nc(N[C@@H]2CC[C@@H](CC2)NC(=O)c2ccc(Cl)c(Cl)c2)nc2ccccc12 |wU:10.13,7.6,(-2.35,4.13,;-3.68,3.35,;-5.01,4.12,;-3.68,1.81,;-2.33,1.05,;-2.33,-.5,;-1,-1.24,;.35,-.49,;1.69,-1.27,;3.02,-.5,;3.02,1.04,;1.68,1.81,;.33,1.04,;4.35,1.81,;5.68,1.04,;5.68,-.5,;7.01,1.81,;8.35,1.04,;9.68,1.81,;9.68,3.35,;11.01,4.12,;8.34,4.12,;8.34,5.66,;7.01,3.35,;-3.66,-1.27,;-4.99,-.5,;-6.32,-1.28,;-7.65,-.51,;-7.65,1.03,;-6.32,1.81,;-4.99,1.04,)|
Show InChI InChI=1S/C23H25Cl2N5O/c1-30(2)21-17-5-3-4-6-20(17)28-23(29-21)27-16-10-8-15(9-11-16)26-22(31)14-7-12-18(24)19(25)13-14/h3-7,12-13,15-16H,8-11H2,1-2H3,(H,26,31)(H,27,28,29)/t15-,16+
n/an/a 47n/an/an/an/an/an/a
Taisho Pharmaceutical Co. Ltd.
Curated by ChEMBL
Assay Description
Inhibitory activity against alpha-2A adrenergic receptor by using [3H]MK-912 as radioligand expressed in COS-1 cells
Bioorg Med Chem Lett 15: 3853-6 (2005)
Article DOI: 10.1016/j.bmcl.2005.05.121
BindingDB Entry DOI: 10.7270/Q23R0TM4