BDBM50170219 CHEMBL3805074
SMILES: CCN1CCN(Cc2ccc(NC(=O)Cc3ccc(Oc4cc(NC)ncn4)cc3)cc2C(F)(F)F)CC1
InChI Key: InChIKey=RXTNVGURVJDDNQ-UHFFFAOYSA-N
Data: 3 IC50
Activity Spreadsheet -- Enzyme Inhibition Constant Data from BindingDB
Found 3 hits for monomerid = 50170219
Trg + Lig
Ki
nM
ΔG°
kcal/mole
IC50
nM
Kd
nM
EC50/IC50
nM
koff
s-1
kon
M-1s-1
pHTemp
°C
MAP kinase-interacting serine/threonine-protein kinase 1
(Homo sapiens (Human))
BDBM50170219
(CHEMBL3805074)
Show SMILES CCN1CCN(Cc2ccc(NC(=O)Cc3ccc(Oc4cc(NC)ncn4)cc3)cc2C(F)(F)F)CC1
Show InChI InChI=1S/C27H31F3N6O2/c1-3-35-10-12-36(13-11-35)17-20-6-7-21(15-23(20)27(28,29)30)34-25(37)14-19-4-8-22(9-5-19)38-26-16-24(31-2)32-18-33-26/h4-9,15-16,18H,3,10-14,17H2,1-2H3,(H,34,37)(H,31,32,33)
NCI pathway
Reactome pathway
n/an/a 3.69E+3n/an/an/an/an/an/a
Experimental Therapeutics Centre
Curated by ChEMBL
Assay Description
Inhibition of N-terminal GST-tagged MNK1 kinase domain (37 to 341 residues) (unknown origin) expressed in Escherichia coli BL21(DE3) cells using JH3 ...
J Med Chem 59: 3063-78 (2016)
BindingDB Entry DOI: 10.7270/Q2028TF3
MAP kinase-interacting serine/threonine-protein kinase 2
(Homo sapiens (Human))
BDBM50170219
(CHEMBL3805074)
Show SMILES CCN1CCN(Cc2ccc(NC(=O)Cc3ccc(Oc4cc(NC)ncn4)cc3)cc2C(F)(F)F)CC1
Show InChI InChI=1S/C27H31F3N6O2/c1-3-35-10-12-36(13-11-35)17-20-6-7-21(15-23(20)27(28,29)30)34-25(37)14-19-4-8-22(9-5-19)38-26-16-24(31-2)32-18-33-26/h4-9,15-16,18H,3,10-14,17H2,1-2H3,(H,34,37)(H,31,32,33)
n/an/a 22n/an/an/an/an/an/a
Experimental Therapeutics Centre
Curated by ChEMBL
Assay Description
Inhibition of N-terminal GST-tagged MNK2 kinase domain (72 to 385 residues) (unknown origin) expressed in Escherichia coli BL21(DE3) cells using JH3 ...
J Med Chem 59: 3063-78 (2016)
BindingDB Entry DOI: 10.7270/Q2028TF3
Bcr-Abl
(Homo sapiens (Human))
BDBM50170219
(CHEMBL3805074)
Show SMILES CCN1CCN(Cc2ccc(NC(=O)Cc3ccc(Oc4cc(NC)ncn4)cc3)cc2C(F)(F)F)CC1
Show InChI InChI=1S/C27H31F3N6O2/c1-3-35-10-12-36(13-11-35)17-20-6-7-21(15-23(20)27(28,29)30)34-25(37)14-19-4-8-22(9-5-19)38-26-16-24(31-2)32-18-33-26/h4-9,15-16,18H,3,10-14,17H2,1-2H3,(H,34,37)(H,31,32,33)
NCI pathway
Reactome pathway
n/an/a>1.00E+4n/an/an/an/an/an/a
Experimental Therapeutics Centre
Curated by ChEMBL
Assay Description
Inhibition of BCR fused full length human recombinant N-terminal His-tagged ABL (2 to 1130 residues) expressed in baculovirus expression system using...
J Med Chem 59: 3063-78 (2016)
BindingDB Entry DOI: 10.7270/Q2028TF3