null
SMILES: Oc1noc2cc(Cl)ccc12
InChI Key: InChIKey=SJAPSPJRTQCDNO-UHFFFAOYSA-N
Activity Spreadsheet -- Enzyme Inhibition Constant Data from BindingDB
Found 5 hits for monomerid = 50170230
Trg + Lig
Ki
nM
ΔG°
kcal/mole
IC50
nM
Kd
nM
EC50/IC50
nM
koff
s-1
kon
M-1s-1
pHTemp
°C
D-amino-acid oxidase
(Homo sapiens (Human))
BDBM50170230
(CHEMBL445990)
Show SMILES Oc1noc2cc(Cl)ccc12
Show InChI InChI=1S/C7H4ClNO2/c8-4-1-2-5-6(3-4)11-9-7(5)10/h1-3H,(H,9,10)
Reactome pathway
n/an/a 110n/an/an/an/an/an/a
Shanghai Jiao Tong University
Curated by ChEMBL
Assay Description
Inhibition of human recombinant DAAO using D-alanine as substrate assessed as pyruvate production incubated for 60 mins by microplate reader analysis
Eur J Med Chem 117: 19-32 (2016)
BindingDB Entry DOI: 10.7270/Q2V989ZS
D-amino-acid oxidase
(Rattus norvegicus (rat))
BDBM50170230
(CHEMBL445990)
Show SMILES Oc1noc2cc(Cl)ccc12
Show InChI InChI=1S/C7H4ClNO2/c8-4-1-2-5-6(3-4)11-9-7(5)10/h1-3H,(H,9,10)
Reactome pathway
n/an/a 90n/an/an/an/an/an/a
Shanghai Jiao Tong University
Curated by ChEMBL
Assay Description
Inhibition of rat spinal DAAO using D-alanine as substrate assessed as pyruvate production incubated for 60 mins by microplate reader analysis
Eur J Med Chem 117: 19-32 (2016)
BindingDB Entry DOI: 10.7270/Q2V989ZS
D-amino-acid oxidase
(Sus scrofa (pig))
BDBM50170230
(CHEMBL445990)
Show SMILES Oc1noc2cc(Cl)ccc12
Show InChI InChI=1S/C7H4ClNO2/c8-4-1-2-5-6(3-4)11-9-7(5)10/h1-3H,(H,9,10)
Reactome pathway
n/an/an/a 870n/an/an/an/an/a
Hungarian Academy of Sciences
Curated by ChEMBL
Assay Description
Binding affinity to pig kidney DAAO by ITC method
Bioorg Med Chem 26: 1579-1587 (2018)
Article DOI: 10.1016/j.bmc.2018.02.004
BindingDB Entry DOI: 10.7270/Q2VQ359V
D-amino-acid oxidase
(Homo sapiens (Human))
BDBM50170230
(CHEMBL445990)
Show SMILES Oc1noc2cc(Cl)ccc12
Show InChI InChI=1S/C7H4ClNO2/c8-4-1-2-5-6(3-4)11-9-7(5)10/h1-3H,(H,9,10)
Reactome pathway
n/an/a 27n/an/an/an/an/an/a
Hungarian Academy of Sciences
Curated by ChEMBL
Assay Description
Inhibition of human DAAO using D-KYN as substrate preincubated for 20 mins followed by substrate addition measured after 30 mins by FP-6300-based flu...
Bioorg Med Chem 26: 1579-1587 (2018)
Article DOI: 10.1016/j.bmc.2018.02.004
BindingDB Entry DOI: 10.7270/Q2VQ359V
D-amino-acid oxidase
(Sus scrofa (pig))
BDBM50170230
(CHEMBL445990)
Show SMILES Oc1noc2cc(Cl)ccc12
Show InChI InChI=1S/C7H4ClNO2/c8-4-1-2-5-6(3-4)11-9-7(5)10/h1-3H,(H,9,10)
Reactome pathway
n/an/a 210n/an/an/an/an/an/a
Shanghai Jiao Tong University
Curated by ChEMBL
Assay Description
Inhibition of DAAO in porcine kidney homogenate using D-alanine as substrate assessed as pyruvate production incubated for 5 mins by microplate reade...
Eur J Med Chem 117: 19-32 (2016)
BindingDB Entry DOI: 10.7270/Q2V989ZS