BDBM50170305 (S)-2-{4'-[(Benzofuran-2-carbonyl)-amino]-biphenyl-4-sulfonylamino}-3-(3H-imidazol-4-yl)-propionic acid::CHEMBL188707
SMILES: OC(=O)[C@H](Cc1cnc[nH]1)NS(=O)(=O)c1ccc(cc1)-c1ccc(NC(=O)c2cc3ccccc3o2)cc1
InChI Key: InChIKey=DCFQDPBZWWAPCG-QHCPKHFHSA-N
Data: 2 IC50
Activity Spreadsheet -- Enzyme Inhibition Constant Data from BindingDB
Found 2 hits for monomerid = 50170305
Trg + Lig
Ki
nM
ΔG°
kcal/mole
IC50
nM
Kd
nM
EC50/IC50
nM
koff
s-1
kon
M-1s-1
pHTemp
°C
Matrix metalloproteinase 13
(Bos taurus)
BDBM50170305
((S)-2-{4'-[(Benzofuran-2-carbonyl)-amino]-biphenyl...)
Show SMILES OC(=O)[C@H](Cc1cnc[nH]1)NS(=O)(=O)c1ccc(cc1)-c1ccc(NC(=O)c2cc3ccccc3o2)cc1
Show InChI InChI=1S/C27H22N4O6S/c32-26(25-13-19-3-1-2-4-24(19)37-25)30-20-9-5-17(6-10-20)18-7-11-22(12-8-18)38(35,36)31-23(27(33)34)14-21-15-28-16-29-21/h1-13,15-16,23,31H,14H2,(H,28,29)(H,30,32)(H,33,34)/t23-/m0/s1
n/an/a 8.10n/an/an/an/an/an/a
Wyeth Research
Curated by ChEMBL
Assay Description
Inhibitory concentration against MMP-13 of bovine articular cartilage explants
Bioorg Med Chem Lett 15: 4105-9 (2005)
Article DOI: 10.1016/j.bmcl.2005.06.019
BindingDB Entry DOI: 10.7270/Q2TX3DXK
72 kDa type IV collagenase
(Homo sapiens (Human))
BDBM50170305
((S)-2-{4'-[(Benzofuran-2-carbonyl)-amino]-biphenyl...)
Show SMILES OC(=O)[C@H](Cc1cnc[nH]1)NS(=O)(=O)c1ccc(cc1)-c1ccc(NC(=O)c2cc3ccccc3o2)cc1
Show InChI InChI=1S/C27H22N4O6S/c32-26(25-13-19-3-1-2-4-24(19)37-25)30-20-9-5-17(6-10-20)18-7-11-22(12-8-18)38(35,36)31-23(27(33)34)14-21-15-28-16-29-21/h1-13,15-16,23,31H,14H2,(H,28,29)(H,30,32)(H,33,34)/t23-/m0/s1
Reactome pathway
n/an/a 37n/an/an/an/an/an/a
Wyeth Research
Curated by ChEMBL
Assay Description
Inhibitory concentration against MMP-2
Bioorg Med Chem Lett 15: 4105-9 (2005)
Article DOI: 10.1016/j.bmcl.2005.06.019
BindingDB Entry DOI: 10.7270/Q2TX3DXK