BDBM50170809 (1R,4R,5R)-1,4,5-Trihydroxy-3-(3-nitro-phenyl)-cyclohex-2-enecarboxylic acid::CHEMBL188524
SMILES: O[C@@H]1C[C@@](O)(C=C([C@H]1O)c1cccc(c1)[N+]([O-])=O)C(O)=O
InChI Key: InChIKey=AZKBVJLQNQFBRJ-WZRBSPASSA-N
Data: 2 KI
Activity Spreadsheet -- Enzyme Inhibition Constant Data from BindingDB
Found 2 hits for monomerid = 50170809
Trg + Lig
Ki
nM
ΔG°
kcal/mole
IC50
nM
Kd
nM
EC50/IC50
nM
koff
s-1
kon
M-1s-1
pHTemp
°C
3-dehydroquinate dehydratase
(Mycobacterium tuberculosis)
BDBM50170809
((1R,4R,5R)-1,4,5-Trihydroxy-3-(3-nitro-phenyl)-cyc...)
Show SMILES O[C@@H]1C[C@@](O)(C=C([C@H]1O)c1cccc(c1)[N+]([O-])=O)C(O)=O |c:5|
Show InChI InChI=1S/C13H13NO7/c15-10-6-13(19,12(17)18)5-9(11(10)16)7-2-1-3-8(4-7)14(20)21/h1-5,10-11,15-16,19H,6H2,(H,17,18)/t10-,11-,13+/m1/s1
Reactome pathway
54n/an/an/an/an/an/an/an/a
Universidad de Santiago de Compostela
Curated by ChEMBL
Assay Description
Competitive inhibition of Mycobacterium tuberculosis DHQ2
J Med Chem 54: 6063-84 (2011)
Article DOI: 10.1021/jm2006063
BindingDB Entry DOI: 10.7270/Q2XS5VSG
3-dehydroquinate dehydratase
(Mycobacterium tuberculosis)
BDBM50170809
((1R,4R,5R)-1,4,5-Trihydroxy-3-(3-nitro-phenyl)-cyc...)
Show SMILES O[C@@H]1C[C@@](O)(C=C([C@H]1O)c1cccc(c1)[N+]([O-])=O)C(O)=O |c:5|
Show InChI InChI=1S/C13H13NO7/c15-10-6-13(19,12(17)18)5-9(11(10)16)7-2-1-3-8(4-7)14(20)21/h1-5,10-11,15-16,19H,6H2,(H,17,18)/t10-,11-,13+/m1/s1
Reactome pathway
54n/an/an/an/an/an/a8.2n/a
Universidad de Santiago de Compostela
Curated by ChEMBL
Assay Description
Inhibition of Mycobacterium tuberculosis type II dehydroquinase at 25 degree C pH 8.2
J Med Chem 48: 4871-81 (2005)
Article DOI: 10.1021/jm0501836
BindingDB Entry DOI: 10.7270/Q2RX9BMC