BDBM50170936 CHEMBL3805179
SMILES: N[C@H]1C[C@H](CC[C@@H]1c1cc(F)c(F)cc1F)N1Cc2nn3c(ccnc3c2C1)C(F)(F)F
InChI Key: InChIKey=AJGKSIDNLVRWTM-RVPKQNPDSA-N
Data: 3 IC50
Activity Spreadsheet -- Enzyme Inhibition Constant Data from BindingDB
Found 3 hits for monomerid = 50170936
Trg + Lig
Ki
nM
ΔG°
kcal/mole
IC50
nM
Kd
nM
EC50/IC50
nM
koff
s-1
kon
M-1s-1
pHTemp
°C
Acyl-protein thioesterase 1
(Rattus norvegicus)
BDBM50170936
(CHEMBL3805179)
Show SMILES N[C@H]1C[C@H](CC[C@@H]1c1cc(F)c(F)cc1F)N1Cc2nn3c(ccnc3c2C1)C(F)(F)F |r|
Show InChI InChI=1S/C21H19F6N5/c22-14-7-16(24)15(23)6-12(14)11-2-1-10(5-17(11)28)31-8-13-18(9-31)30-32-19(21(25,26)27)3-4-29-20(13)32/h3-4,6-7,10-11,17H,1-2,5,8-9,28H2/t10-,11+,17-/m0/s1
Reactome pathway
n/an/a 6.40E+3n/an/an/an/an/an/a
Merck Research Laboratories
Curated by ChEMBL
Assay Description
Inhibition of human FAP
Bioorg Med Chem Lett 26: 2622-6 (2016)
BindingDB Entry DOI: 10.7270/Q2Z321JP
Dipeptidyl peptidase 4
(Homo sapiens (Human))
BDBM50170936
(CHEMBL3805179)
Show SMILES N[C@H]1C[C@H](CC[C@@H]1c1cc(F)c(F)cc1F)N1Cc2nn3c(ccnc3c2C1)C(F)(F)F |r|
Show InChI InChI=1S/C21H19F6N5/c22-14-7-16(24)15(23)6-12(14)11-2-1-10(5-17(11)28)31-8-13-18(9-31)30-32-19(21(25,26)27)3-4-29-20(13)32/h3-4,6-7,10-11,17H,1-2,5,8-9,28H2/t10-,11+,17-/m0/s1
Reactome pathway
n/an/a 1.10n/an/an/an/an/an/a
Merck Research Laboratories
Curated by ChEMBL
Assay Description
Inhibition of human DPP4
Bioorg Med Chem Lett 26: 2622-6 (2016)
BindingDB Entry DOI: 10.7270/Q2Z321JP
Dipeptidyl peptidase 8
(Homo sapiens (Human))
BDBM50170936
(CHEMBL3805179)
Show SMILES N[C@H]1C[C@H](CC[C@@H]1c1cc(F)c(F)cc1F)N1Cc2nn3c(ccnc3c2C1)C(F)(F)F |r|
Show InChI InChI=1S/C21H19F6N5/c22-14-7-16(24)15(23)6-12(14)11-2-1-10(5-17(11)28)31-8-13-18(9-31)30-32-19(21(25,26)27)3-4-29-20(13)32/h3-4,6-7,10-11,17H,1-2,5,8-9,28H2/t10-,11+,17-/m0/s1
n/an/a 1.80E+4n/an/an/an/an/an/a
Merck Research Laboratories
Curated by ChEMBL
Assay Description
Inhibition of DPP8 (unknown origin)
Bioorg Med Chem Lett 26: 2622-6 (2016)
BindingDB Entry DOI: 10.7270/Q2Z321JP