null
SMILES: CCOc1cc(Br)cnc1Nc1cccc(C)n1
InChI Key: InChIKey=JJRWFNDSSULAFZ-UHFFFAOYSA-N
Activity Spreadsheet -- Enzyme Inhibition Constant Data from BindingDB
Found 1 hit for monomerid = 50171061
Trg + Lig
Ki
nM
ΔG°
kcal/mole
IC50
nM
Kd
nM
EC50/IC50
nM
koff
s-1
kon
M-1s-1
pHTemp
°C
Metabotropic glutamate receptor 5
(Homo sapiens (Human))
BDBM50171061
((5-Bromo-3-ethoxy-pyridin-2-yl)-(6-methyl-pyridin-...)
Show SMILES CCOc1cc(Br)cnc1Nc1cccc(C)n1
Show InChI InChI=1S/C13H14BrN3O/c1-3-18-11-7-10(14)8-15-13(11)17-12-6-4-5-9(2)16-12/h4-8H,3H2,1-2H3,(H,15,16,17)
n/an/a 47n/an/an/an/an/an/a
Merck Research Laboratories
Curated by ChEMBL
Assay Description
In vitro potency against calcium flux in Ltk cells expressing human recombinant metabotropic glutamate receptor 5 using fluorescence detection
Bioorg Med Chem Lett 15: 4350-3 (2005)
Article DOI: 10.1016/j.bmcl.2005.06.059
BindingDB Entry DOI: 10.7270/Q2QZ29H0