null
SMILES: CN(Cc1ccccc1)C(=O)CN(Cc1ccc(c(Br)c1)C(F)(F)P(O)(O)=O)S(=O)(=O)c1ccc(OCC(O)=O)cc1
InChI Key: InChIKey=DRGILYSXCIOSKI-UHFFFAOYSA-N
Activity Spreadsheet -- Enzyme Inhibition Constant Data from BindingDB
Found 2 hits for monomerid = 50171106
Trg + Lig
Ki
nM
ΔG°
kcal/mole
IC50
nM
Kd
nM
EC50/IC50
nM
koff
s-1
kon
M-1s-1
pHTemp
°C
Tyrosine-protein phosphatase non-receptor type 1
(Homo sapiens (Human))
BDBM50171106
((4-{[(Benzyl-methyl-carbamoyl)-methyl]-[3-bromo-4-...)
Show SMILES CN(Cc1ccccc1)C(=O)CN(Cc1ccc(c(Br)c1)C(F)(F)P(O)(O)=O)S(=O)(=O)c1ccc(OCC(O)=O)cc1
Show InChI InChI=1S/C26H26BrF2N2O9PS/c1-30(14-18-5-3-2-4-6-18)24(32)16-31(42(38,39)21-10-8-20(9-11-21)40-17-25(33)34)15-19-7-12-22(23(27)13-19)26(28,29)41(35,36)37/h2-13H,14-17H2,1H3,(H,33,34)(H2,35,36,37)
NCI pathway
Reactome pathway
14n/an/an/an/an/an/an/an/a
Affymax, Inc.
Curated by ChEMBL
Assay Description
Inhibitory activity against protein tyrosine phosphatase 1B using O-methyl fluorescein monophosphate
Bioorg Med Chem Lett 15: 4336-41 (2005)
Article DOI: 10.1016/j.bmcl.2005.06.061
BindingDB Entry DOI: 10.7270/Q2M61JSK
Tyrosine-protein phosphatase non-receptor type 1
(Homo sapiens (Human))
BDBM50171106
((4-{[(Benzyl-methyl-carbamoyl)-methyl]-[3-bromo-4-...)
Show SMILES CN(Cc1ccccc1)C(=O)CN(Cc1ccc(c(Br)c1)C(F)(F)P(O)(O)=O)S(=O)(=O)c1ccc(OCC(O)=O)cc1
Show InChI InChI=1S/C26H26BrF2N2O9PS/c1-30(14-18-5-3-2-4-6-18)24(32)16-31(42(38,39)21-10-8-20(9-11-21)40-17-25(33)34)15-19-7-12-22(23(27)13-19)26(28,29)41(35,36)37/h2-13H,14-17H2,1H3,(H,33,34)(H2,35,36,37)
NCI pathway
Reactome pathway
n/an/a 31n/an/an/an/an/an/a
Affymax, Inc.
Curated by ChEMBL
Assay Description
Inhibitory activity against protein tyrosine phosphatase 1B using O-methyl fluorescein monophosphate
Bioorg Med Chem Lett 15: 4336-41 (2005)
Article DOI: 10.1016/j.bmcl.2005.06.061
BindingDB Entry DOI: 10.7270/Q2M61JSK