BDBM50171177 Acetic acid (3S,4aR,4bS,6S,8R,8aR,10aR)-8-cyclopropylcarbamoyl-3-furan-3-yl-4a,8a-dimethyl-1,5-dioxo-dodecahydro-2-oxa-phenanthren-6-yl ester::CHEMBL426094
SMILES: CC(=O)O[C@H]1C[C@@H](C(=O)NC2CC2)[C@]2(C)CC[C@H]3C(=O)O[C@@H](C[C@]3(C)[C@H]2C1=O)c1ccoc1
InChI Key: InChIKey=HUQGTFWUSCBZGA-BYDLNXCSSA-N
Data: 1 KI
Activity Spreadsheet -- Enzyme Inhibition Constant Data from BindingDB
Found 1 hit for monomerid = 50171177
Trg + Lig
Ki
nM
ΔG°
kcal/mole
IC50
nM
Kd
nM
EC50/IC50
nM
koff
s-1
kon
M-1s-1
pHTemp
°C
Kappa-type opioid receptor
(Homo sapiens (Human))
BDBM50171177
(Acetic acid (3S,4aR,4bS,6S,8R,8aR,10aR)-8-cyclopro...)
Show SMILES CC(=O)O[C@H]1C[C@@H](C(=O)NC2CC2)[C@]2(C)CC[C@H]3C(=O)O[C@@H](C[C@]3(C)[C@H]2C1=O)c1ccoc1
Show InChI InChI=1S/C25H31NO7/c1-13(27)32-18-10-17(22(29)26-15-4-5-15)24(2)8-6-16-23(30)33-19(14-7-9-31-12-14)11-25(16,3)21(24)20(18)28/h7,9,12,15-19,21H,4-6,8,10-11H2,1-3H3,(H,26,29)/t16-,17-,18-,19-,21-,24-,25-/m0/s1
Reactome pathway
>1.00E+3n/an/an/an/an/an/an/an/a
Harvard Medical School
Curated by ChEMBL
Assay Description
Binding affinity for 1 uM [3H]-diprenorphine against human Opioid receptor kappa expressed in chinese hamster ovary cells (CHO cells)
Bioorg Med Chem Lett 15: 4169-73 (2005)
Article DOI: 10.1016/j.bmcl.2005.06.092
BindingDB Entry DOI: 10.7270/Q2BP02BX