BDBM50171546 (S)-2,4-Diamino-N-((R)-1-boron-dihydroxide-pentyl)-butyramide::CHEMBL194354
SMILES: CCCC[C@@H](NC(=O)[C@@H](N)CCN)B(O)O
InChI Key: InChIKey=JAXKDVVQQUKJKR-JGVFFNPUSA-N
Data: 3 IC50
Activity Spreadsheet -- Enzyme Inhibition Constant Data from BindingDB
Found 3 hits for monomerid = 50171546
Trg + Lig
Ki
nM
ΔG°
kcal/mole
IC50
nM
Kd
nM
EC50/IC50
nM
koff
s-1
kon
M-1s-1
pHTemp
°C
Dipeptidyl peptidase 2 (DPP II)
(Homo sapiens (Human))
BDBM50171546
((S)-2,4-Diamino-N-((R)-1-boron-dihydroxide-pentyl)...)
Show SMILES CCCC[C@@H](NC(=O)[C@@H](N)CCN)B(O)O
Show InChI InChI=1S/C9H22BN3O3/c1-2-3-4-8(10(15)16)13-9(14)7(12)5-6-11/h7-8,15-16H,2-6,11-12H2,1H3,(H,13,14)/t7-,8+/m0/s1
n/an/a 0.480n/an/an/an/an/an/a
ActivX Biosciences
Curated by ChEMBL
Assay Description
Inhibitory concentration against human dipeptidylpeptidase 7
Bioorg Med Chem Lett 15: 4256-60 (2005)
Article DOI: 10.1016/j.bmcl.2005.06.076
BindingDB Entry DOI: 10.7270/Q2RR1XSW
Dipeptidyl peptidase 9
(Homo sapiens (Human))
BDBM50171546
((S)-2,4-Diamino-N-((R)-1-boron-dihydroxide-pentyl)...)
Show SMILES CCCC[C@@H](NC(=O)[C@@H](N)CCN)B(O)O
Show InChI InChI=1S/C9H22BN3O3/c1-2-3-4-8(10(15)16)13-9(14)7(12)5-6-11/h7-8,15-16H,2-6,11-12H2,1H3,(H,13,14)/t7-,8+/m0/s1
n/an/a 800n/an/an/an/an/an/a
ActivX Biosciences
Curated by ChEMBL
Assay Description
Inhibitory concentration against human dipeptidylpeptidase 9 using FP-TAMRA incubated for 30 min
Bioorg Med Chem Lett 15: 4256-60 (2005)
Article DOI: 10.1016/j.bmcl.2005.06.076
BindingDB Entry DOI: 10.7270/Q2RR1XSW
Dipeptidyl peptidase VIII
(Homo sapiens (Human))
BDBM50171546
((S)-2,4-Diamino-N-((R)-1-boron-dihydroxide-pentyl)...)
Show SMILES CCCC[C@@H](NC(=O)[C@@H](N)CCN)B(O)O
Show InChI InChI=1S/C9H22BN3O3/c1-2-3-4-8(10(15)16)13-9(14)7(12)5-6-11/h7-8,15-16H,2-6,11-12H2,1H3,(H,13,14)/t7-,8+/m0/s1
n/an/a 4.30E+3n/an/an/an/an/an/a
ActivX Biosciences
Curated by ChEMBL
Assay Description
Inhibitory concentration against human dipeptidylpeptidase 8 using FP-TAMRA incubated for 30 min
Bioorg Med Chem Lett 15: 4256-60 (2005)
Article DOI: 10.1016/j.bmcl.2005.06.076
BindingDB Entry DOI: 10.7270/Q2RR1XSW