BDBM50171648 CHEMBL372180::N-alkyl Gly-boro-Pro derivative
SMILES: CCCCCC12CCC(CC1)(CC2)NCC(=O)N1CCC[C@H]1B(O)O
InChI Key: InChIKey=FYLALFHFEDXUNH-IVMQYODDSA-N
Data: 3 IC50
Activity Spreadsheet -- Enzyme Inhibition Constant Data from BindingDB
Found 3 hits for monomerid = 50171648
Trg + Lig
Ki
nM
ΔG°
kcal/mole
IC50
nM
Kd
nM
EC50/IC50
nM
koff
s-1
kon
M-1s-1
pHTemp
°C
Fibroblast activation protein alpha
(Homo sapiens (Human))
BDBM50171648
(CHEMBL372180 | N-alkyl Gly-boro-Pro derivative)
Show SMILES CCCCCC12CCC(CC1)(CC2)NCC(=O)N1CCC[C@H]1B(O)O
Show InChI InChI=1S/C19H35BN2O3/c1-2-3-4-7-18-8-11-19(12-9-18,13-10-18)21-15-17(23)22-14-5-6-16(22)20(24)25/h16,21,24-25H,2-15H2,1H3/t16-,18?,19?/m0/s1
n/an/a 270n/an/an/an/an/an/a
ActivX Biosciences, Inc.
Curated by ChEMBL
Assay Description
Inhibitory activity against human FAP using Lys-Pro-AMC in fluorometric assay
Bioorg Med Chem Lett 15: 4239-42 (2005)
Article DOI: 10.1016/j.bmcl.2005.06.075
BindingDB Entry DOI: 10.7270/Q2CJ8D2F
Dipeptidyl peptidase 2 (DPP II)
(Homo sapiens (Human))
BDBM50171648
(CHEMBL372180 | N-alkyl Gly-boro-Pro derivative)
Show SMILES CCCCCC12CCC(CC1)(CC2)NCC(=O)N1CCC[C@H]1B(O)O
Show InChI InChI=1S/C19H35BN2O3/c1-2-3-4-7-18-8-11-19(12-9-18,13-10-18)21-15-17(23)22-14-5-6-16(22)20(24)25/h16,21,24-25H,2-15H2,1H3/t16-,18?,19?/m0/s1
n/an/a 1n/an/an/an/an/an/a
ActivX Biosciences, Inc.
Curated by ChEMBL
Assay Description
Inhibitory activity against human DPP7 using Ala-Pro-AMC in fluorometric assay
Bioorg Med Chem Lett 15: 4239-42 (2005)
Article DOI: 10.1016/j.bmcl.2005.06.075
BindingDB Entry DOI: 10.7270/Q2CJ8D2F
Dipeptidyl peptidase 4
(Homo sapiens (Human))
BDBM50171648
(CHEMBL372180 | N-alkyl Gly-boro-Pro derivative)
Show SMILES CCCCCC12CCC(CC1)(CC2)NCC(=O)N1CCC[C@H]1B(O)O
Show InChI InChI=1S/C19H35BN2O3/c1-2-3-4-7-18-8-11-19(12-9-18,13-10-18)21-15-17(23)22-14-5-6-16(22)20(24)25/h16,21,24-25H,2-15H2,1H3/t16-,18?,19?/m0/s1
Reactome pathway
n/an/a 61n/an/an/an/an/an/a
ActivX Biosciences, Inc.
Curated by ChEMBL
Assay Description
Inhibitory activity against human DPP4 using Gly-Pro-AMC in fluorometric assay
Bioorg Med Chem Lett 15: 4239-42 (2005)
Article DOI: 10.1016/j.bmcl.2005.06.075
BindingDB Entry DOI: 10.7270/Q2CJ8D2F