BDBM50171656 2-Cyclohexylamino-1-pyrrolidin-1-yl--2-borandihydroxy-ethanone::CHEMBL371130
SMILES: OB(O)[C@@H]1CCCN1C(=O)CNC1CCCCC1
InChI Key: InChIKey=LHBJCBLEWINWEE-NSHDSACASA-N
Data: 3 IC50
Activity Spreadsheet -- Enzyme Inhibition Constant Data from BindingDB
Found 3 hits for monomerid = 50171656
Trg + Lig
Ki
nM
ΔG°
kcal/mole
IC50
nM
Kd
nM
EC50/IC50
nM
koff
s-1
kon
M-1s-1
pHTemp
°C
Fibroblast activation protein alpha
(Homo sapiens (Human))
BDBM50171656
(2-Cyclohexylamino-1-pyrrolidin-1-yl--2-borandihydr...)
Show SMILES OB(O)[C@@H]1CCCN1C(=O)CNC1CCCCC1
Show InChI InChI=1S/C12H23BN2O3/c16-12(9-14-10-5-2-1-3-6-10)15-8-4-7-11(15)13(17)18/h10-11,14,17-18H,1-9H2/t11-/m0/s1
n/an/a 650n/an/an/an/an/an/a
ActivX Biosciences, Inc.
Curated by ChEMBL
Assay Description
Inhibitory activity against human FAP using Lys-Pro-AMC in fluorometric assay
Bioorg Med Chem Lett 15: 4239-42 (2005)
Article DOI: 10.1016/j.bmcl.2005.06.075
BindingDB Entry DOI: 10.7270/Q2CJ8D2F
Dipeptidyl peptidase 4
(Homo sapiens (Human))
BDBM50171656
(2-Cyclohexylamino-1-pyrrolidin-1-yl--2-borandihydr...)
Show SMILES OB(O)[C@@H]1CCCN1C(=O)CNC1CCCCC1
Show InChI InChI=1S/C12H23BN2O3/c16-12(9-14-10-5-2-1-3-6-10)15-8-4-7-11(15)13(17)18/h10-11,14,17-18H,1-9H2/t11-/m0/s1
Reactome pathway
n/an/a 27n/an/an/an/an/an/a
ActivX Biosciences, Inc.
Curated by ChEMBL
Assay Description
Inhibitory activity against human DPP4 using Gly-Pro-AMC in fluorometric assay
Bioorg Med Chem Lett 15: 4239-42 (2005)
Article DOI: 10.1016/j.bmcl.2005.06.075
BindingDB Entry DOI: 10.7270/Q2CJ8D2F
Dipeptidyl peptidase 2 (DPP II)
(Homo sapiens (Human))
BDBM50171656
(2-Cyclohexylamino-1-pyrrolidin-1-yl--2-borandihydr...)
Show SMILES OB(O)[C@@H]1CCCN1C(=O)CNC1CCCCC1
Show InChI InChI=1S/C12H23BN2O3/c16-12(9-14-10-5-2-1-3-6-10)15-8-4-7-11(15)13(17)18/h10-11,14,17-18H,1-9H2/t11-/m0/s1
n/an/a 4.10n/an/an/an/an/an/a
ActivX Biosciences, Inc.
Curated by ChEMBL
Assay Description
Inhibitory activity against human DPP7 using Ala-Pro-AMC in fluorometric assay
Bioorg Med Chem Lett 15: 4239-42 (2005)
Article DOI: 10.1016/j.bmcl.2005.06.075
BindingDB Entry DOI: 10.7270/Q2CJ8D2F