BDBM50171723 4-Ethyl-2-(4-hydroxy-phenyl)-quinolin-6-ol::4-ethyl-2-(4-hydroxyphenyl)quinolin-6-ol::CHEMBL198679
SMILES: CCc1cc(nc2ccc(O)cc12)-c1ccc(O)cc1
InChI Key: InChIKey=JHGHNHLKUJDBRE-UHFFFAOYSA-N
Data: 4 IC50
Activity Spreadsheet -- Enzyme Inhibition Constant Data from BindingDB
Found 4 hits for monomerid = 50171723
Trg + Lig
Ki
nM
ΔG°
kcal/mole
IC50
nM
Kd
nM
EC50/IC50
nM
koff
s-1
kon
M-1s-1
pHTemp
°C
Estrogen receptor
(Homo sapiens (Human))
BDBM50171723
(4-Ethyl-2-(4-hydroxy-phenyl)-quinolin-6-ol | 4-eth...)
Show SMILES CCc1cc(nc2ccc(O)cc12)-c1ccc(O)cc1
Show InChI InChI=1S/C17H15NO2/c1-2-11-9-17(12-3-5-13(19)6-4-12)18-16-8-7-14(20)10-15(11)16/h3-10,19-20H,2H2,1H3
n/an/a 634n/an/an/an/an/an/a
Wyeth Research
Curated by ChEMBL
Assay Description
Binding affinity for human Estrogen receptor alpha
Bioorg Med Chem Lett 15: 4520-5 (2005)
Article DOI: 10.1016/j.bmcl.2005.07.008
BindingDB Entry DOI: 10.7270/Q20864VH
Estrogen-related receptor alpha
(Homo sapiens (Human))
BDBM50171723
(4-Ethyl-2-(4-hydroxy-phenyl)-quinolin-6-ol | 4-eth...)
Show SMILES CCc1cc(nc2ccc(O)cc12)-c1ccc(O)cc1
Show InChI InChI=1S/C17H15NO2/c1-2-11-9-17(12-3-5-13(19)6-4-12)18-16-8-7-14(20)10-15(11)16/h3-10,19-20H,2H2,1H3
Reactome pathway
n/an/a 52n/an/an/an/an/an/a
Wyeth Research
Curated by ChEMBL
Assay Description
Inhibition of human ERalpha
Bioorg Med Chem Lett 17: 4053-6 (2007)
Article DOI: 10.1016/j.bmcl.2007.04.068
BindingDB Entry DOI: 10.7270/Q2V124HV
Estrogen-related receptor beta
(Homo sapiens (Human))
BDBM50171723
(4-Ethyl-2-(4-hydroxy-phenyl)-quinolin-6-ol | 4-eth...)
Show SMILES CCc1cc(nc2ccc(O)cc12)-c1ccc(O)cc1
Show InChI InChI=1S/C17H15NO2/c1-2-11-9-17(12-3-5-13(19)6-4-12)18-16-8-7-14(20)10-15(11)16/h3-10,19-20H,2H2,1H3
Reactome pathway
n/an/a 634n/an/an/an/an/an/a
Wyeth Research
Curated by ChEMBL
Assay Description
Inhibition of human ERbeta
Bioorg Med Chem Lett 17: 4053-6 (2007)
Article DOI: 10.1016/j.bmcl.2007.04.068
BindingDB Entry DOI: 10.7270/Q2V124HV
Estradiol receptor beta (ERβ)
(Homo sapiens (Human))
BDBM50171723
(4-Ethyl-2-(4-hydroxy-phenyl)-quinolin-6-ol | 4-eth...)
Show SMILES CCc1cc(nc2ccc(O)cc12)-c1ccc(O)cc1
Show InChI InChI=1S/C17H15NO2/c1-2-11-9-17(12-3-5-13(19)6-4-12)18-16-8-7-14(20)10-15(11)16/h3-10,19-20H,2H2,1H3
n/an/a 52n/an/an/an/an/an/a
Wyeth Research
Curated by ChEMBL
Assay Description
Binding affinity for human Estrogen receptor beta
Bioorg Med Chem Lett 15: 4520-5 (2005)
Article DOI: 10.1016/j.bmcl.2005.07.008
BindingDB Entry DOI: 10.7270/Q20864VH