BDBM50172130 2-{[3-(pyridin-3-yloxy)cyclohex-1-en-1-yl]ethynyl}pyridine::CHEMBL426467
SMILES: C1CC(Oc2cccnc2)C=C(C1)C#Cc1ccccn1
InChI Key: InChIKey=QWERJDMEHCRBGB-UHFFFAOYSA-N
Data: 1 KI  2 IC50
Activity Spreadsheet -- Enzyme Inhibition Constant Data from BindingDB
Found 3 hits for monomerid = 50172130
Trg + Lig
Ki
nM
ΔG°
kcal/mole
IC50
nM
Kd
nM
EC50/IC50
nM
koff
s-1
kon
M-1s-1
pHTemp
°C
Metabotropic glutamate receptor 5
(Rattus norvegicus (Rat))
BDBM50172130
(2-{[3-(pyridin-3-yloxy)cyclohex-1-en-1-yl]ethynyl}...)
Show SMILES C1CC(Oc2cccnc2)C=C(C1)C#Cc1ccccn1 |c:11|
Show InChI InChI=1S/C18H16N2O/c1-2-12-20-16(6-1)10-9-15-5-3-7-17(13-15)21-18-8-4-11-19-14-18/h1-2,4,6,8,11-14,17H,3,5,7H2
Reactome pathway
1.80n/an/an/an/an/an/an/an/a
Merck Research Laboratories
Curated by ChEMBL
Assay Description
Displacement of [3H]-3-methoxy-5-(pyridin-2-ylethynyl)pyridine from mGlu5 receptor of rat cortical membrane
Bioorg Med Chem Lett 15: 4589-93 (2005)
Article DOI: 10.1016/j.bmcl.2005.06.099
BindingDB Entry DOI: 10.7270/Q2DB81C5
Metabotropic glutamate receptor 5
(Homo sapiens (Human))
BDBM50172130
(2-{[3-(pyridin-3-yloxy)cyclohex-1-en-1-yl]ethynyl}...)
Show SMILES C1CC(Oc2cccnc2)C=C(C1)C#Cc1ccccn1 |c:11|
Show InChI InChI=1S/C18H16N2O/c1-2-12-20-16(6-1)10-9-15-5-3-7-17(13-15)21-18-8-4-11-19-14-18/h1-2,4,6,8,11-14,17H,3,5,7H2
n/an/a 2.20n/an/an/an/an/an/a
Merck Research Laboratories
Curated by ChEMBL
Assay Description
In vitro inhibitory concentration against Ca+2 flux mediated by human mGlu5 receptor expressed in Ltk cells using fura-2 dye
Bioorg Med Chem Lett 15: 4589-93 (2005)
Article DOI: 10.1016/j.bmcl.2005.06.099
BindingDB Entry DOI: 10.7270/Q2DB81C5
Cytochrome P450 1A2
(Homo sapiens (Human))
BDBM50172130
(2-{[3-(pyridin-3-yloxy)cyclohex-1-en-1-yl]ethynyl}...)
Show SMILES C1CC(Oc2cccnc2)C=C(C1)C#Cc1ccccn1 |c:11|
Show InChI InChI=1S/C18H16N2O/c1-2-12-20-16(6-1)10-9-15-5-3-7-17(13-15)21-18-8-4-11-19-14-18/h1-2,4,6,8,11-14,17H,3,5,7H2
Reactome pathway
n/an/a 1.04E+3n/an/an/an/an/an/a
Merck Research Laboratories
Curated by ChEMBL
Assay Description
Inhibitory concentration against CYP1A2 using recombinant CYP450 under Gentest-based protocol
Bioorg Med Chem Lett 15: 4589-93 (2005)
Article DOI: 10.1016/j.bmcl.2005.06.099
BindingDB Entry DOI: 10.7270/Q2DB81C5