BDBM50172283 4-[3-(1-Benzyl-pyrrolidin-3-yl)-indole-1-sulfonyl]-phenylamine::CHEMBL370507
SMILES: Nc1ccc(cc1)S(=O)(=O)n1cc(C2CCN(Cc3ccccc3)C2)c2ccccc12
InChI Key: InChIKey=WABXECNSEHBCHO-UHFFFAOYSA-N
Data: 1 KI  1 IC50
Activity Spreadsheet -- Enzyme Inhibition Constant Data from BindingDB
Found 2 hits for monomerid = 50172283
Trg + Lig
Ki
nM
ΔG°
kcal/mole
IC50
nM
Kd
nM
EC50/IC50
nM
koff
s-1
kon
M-1s-1
pHTemp
°C
5-hydroxytryptamine receptor 6
(Homo sapiens (Human))
BDBM50172283
(4-[3-(1-Benzyl-pyrrolidin-3-yl)-indole-1-sulfonyl]...)
Show SMILES Nc1ccc(cc1)S(=O)(=O)n1cc(C2CCN(Cc3ccccc3)C2)c2ccccc12
Show InChI InChI=1S/C25H25N3O2S/c26-21-10-12-22(13-11-21)31(29,30)28-18-24(23-8-4-5-9-25(23)28)20-14-15-27(17-20)16-19-6-2-1-3-7-19/h1-13,18,20H,14-17,26H2
Reactome pathway
1n/an/an/an/an/an/an/an/a
Wyeth Research
Curated by ChEMBL
Assay Description
Displacement of [3H]-LSD from cloned human 5-hydroxytryptamine 6 receptor expressed in HeLa cells
Bioorg Med Chem Lett 15: 4780-5 (2005)
Article DOI: 10.1016/j.bmcl.2005.07.028
BindingDB Entry DOI: 10.7270/Q2RN37DD
5-hydroxytryptamine receptor 6
(Homo sapiens (Human))
BDBM50172283
(4-[3-(1-Benzyl-pyrrolidin-3-yl)-indole-1-sulfonyl]...)
Show SMILES Nc1ccc(cc1)S(=O)(=O)n1cc(C2CCN(Cc3ccccc3)C2)c2ccccc12
Show InChI InChI=1S/C25H25N3O2S/c26-21-10-12-22(13-11-21)31(29,30)28-18-24(23-8-4-5-9-25(23)28)20-14-15-27(17-20)16-19-6-2-1-3-7-19/h1-13,18,20H,14-17,26H2
Reactome pathway
n/an/a 25n/an/an/an/an/an/a
Wyeth Research
Curated by ChEMBL
Assay Description
Inhibition of cAMP production in HeLa cells expressing human 5-HT6 receptor
Bioorg Med Chem Lett 15: 4780-5 (2005)
Article DOI: 10.1016/j.bmcl.2005.07.028
BindingDB Entry DOI: 10.7270/Q2RN37DD