BDBM50172370 CHEMBL3809767
SMILES: CSCCC(NC(=O)C(NC(=O)C(CC(C)C)NC(=O)C(CC(N)=O)NC(=O)C(NC(=O)C1CCCN1C(=O)C(CCCNC(N)=N)NC(=O)C1CCC(=O)N1)C(C)C)C(C)O)C(=O)NC(CCCNC(N)=N)C(=O)NC(CCCNC(N)=N)C(=O)NC(CCCCN)C(=O)NC(CC(C)C)C(=O)NC(CCCNC(N)=N)C(=O)NC(CCCCN)C(=O)NC(Cc1cnc[nH]1)C(=O)NC(CC(N)=O)C(=O)NC1CSSCC(NC(=O)C(CCCNC(N)=N)NC(=O)C(CCCNC(N)=N)NC(=O)C(CCC(N)=O)NC(=O)C(CC(C)C)NC1=O)C(=O)NC(CCSC)C(=O)N1CCCC1C(=O)NC(CC(C)C)C(=O)NC(Cc1cnc[nH]1)C(=O)NC(CCCNC(N)=N)C(=O)NC(CO)C(=O)NC(C(C)C)C(=O)N1CCCC1C(=O)NC(Cc1ccccc1)C(=O)N1CCCC1C(O)=O
InChI Key: InChIKey=MSIKODAWVKFZMB-XKDNFQCXSA-N
Data: 1 KI  3 EC50
Activity Spreadsheet -- Enzyme Inhibition Constant Data from BindingDB
Found 4 hits for monomerid = 50172370
Trg + Lig
Ki
nM
ΔG°
kcal/mole
IC50
nM
Kd
nM
EC50/IC50
nM
koff
s-1
kon
M-1s-1
pHTemp
°C
Apelin receptor
(Homo sapiens (Human))
BDBM50172370
(CHEMBL3809767)
Show SMILES CSCCC(NC(=O)C(NC(=O)C(CC(C)C)NC(=O)C(CC(N)=O)NC(=O)C(NC(=O)C1CCCN1C(=O)C(CCCNC(N)=N)NC(=O)C1CCC(=O)N1)C(C)C)C(C)O)C(=O)NC(CCCNC(N)=N)C(=O)NC(CCCNC(N)=N)C(=O)NC(CCCCN)C(=O)NC(CC(C)C)C(=O)NC(CCCNC(N)=N)C(=O)NC(CCCCN)C(=O)NC(Cc1cnc[nH]1)C(=O)NC(CC(N)=O)C(=O)NC1CSSCC(NC(=O)C(CCCNC(N)=N)NC(=O)C(CCCNC(N)=N)NC(=O)C(CCC(N)=O)NC(=O)C(CC(C)C)NC1=O)C(=O)NC(CCSC)C(=O)N1CCCC1C(=O)NC(CC(C)C)C(=O)NC(Cc1cnc[nH]1)C(=O)NC(CCCNC(N)=N)C(=O)NC(CO)C(=O)NC(C(C)C)C(=O)N1CCCC1C(=O)NC(Cc1ccccc1)C(=O)N1CCCC1C(O)=O
Show InChI InChI=1S/C170H286N62O39S4/c1-86(2)70-109(214-136(243)96(36-19-21-55-171)202-132(239)98(38-23-57-192-164(176)177)204-134(241)100(40-25-59-194-166(180)181)207-142(249)106(53-68-272-14)211-158(265)131(92(13)234)228-150(257)112(73-89(7)8)215-148(255)116(78-127(175)237)221-157(264)129(90(9)10)226-156(263)123-47-31-65-230(123)159(266)107(44-29-63-198-170(188)189)212-140(247)104-50-52-128(238)201-104)143(250)208-101(41-26-60-195-167(182)183)135(242)203-97(37-20-22-56-172)137(244)217-114(76-95-80-191-85-200-95)147(254)219-115(77-126(174)236)149(256)225-120-83-275-274-82-119(224-139(246)103(43-28-62-197-169(186)187)205-133(240)99(39-24-58-193-165(178)179)206-141(248)105(49-51-125(173)235)210-144(251)110(71-87(3)4)216-153(120)260)152(259)213-108(54-69-273-15)160(267)229-64-30-45-121(229)154(261)220-111(72-88(5)6)145(252)218-113(75-94-79-190-84-199-94)146(253)209-102(42-27-61-196-168(184)185)138(245)223-118(81-233)151(258)227-130(91(11)12)162(269)231-66-32-46-122(231)155(262)222-117(74-93-34-17-16-18-35-93)161(268)232-67-33-48-124(232)163(270)271/h16-18,34-35,79-80,84-92,96-124,129-131,233-234H,19-33,36-78,81-83,171-172H2,1-15H3,(H2,173,235)(H2,174,236)(H2,175,237)(H,190,199)(H,191,200)(H,201,238)(H,202,239)(H,203,242)(H,204,241)(H,205,240)(H,206,248)(H,207,249)(H,208,250)(H,209,253)(H,210,251)(H,211,265)(H,212,247)(H,213,259)(H,214,243)(H,215,255)(H,216,260)(H,217,244)(H,218,252)(H,219,254)(H,220,261)(H,221,264)(H,222,262)(H,223,245)(H,224,246)(H,225,256)(H,226,263)(H,227,258)(H,228,257)(H,270,271)(H4,176,177,192)(H4,178,179,193)(H4,180,181,194)(H4,182,183,195)(H4,184,185,196)(H4,186,187,197)(H4,188,189,198)/t92?,96-,97-,98-,99-,100?,101-,102-,103-,104?,105?,106?,107-,108-,109-,110-,111-,112-,113-,114-,115-,116-,117-,118?,119-,120-,121-,122-,123-,124-,129-,130-,131-/m0/s1
Reactome pathway
0.190n/an/an/an/an/an/an/an/a
Universit£ de Sherbrooke
Curated by ChEMBL
Assay Description
Displacement of [125I]-Apelin-13[Glp65, Nle75, Tyr77] from YFP epitope-tagged human APJ expressed in HEK-293 cells after 1 hr by gamma counting metho...
J Med Chem 59: 2962-72 (2016)
BindingDB Entry DOI: 10.7270/Q23N258H
Apelin receptor
(Homo sapiens (Human))
BDBM50172370
(CHEMBL3809767)
Show SMILES CSCCC(NC(=O)C(NC(=O)C(CC(C)C)NC(=O)C(CC(N)=O)NC(=O)C(NC(=O)C1CCCN1C(=O)C(CCCNC(N)=N)NC(=O)C1CCC(=O)N1)C(C)C)C(C)O)C(=O)NC(CCCNC(N)=N)C(=O)NC(CCCNC(N)=N)C(=O)NC(CCCCN)C(=O)NC(CC(C)C)C(=O)NC(CCCNC(N)=N)C(=O)NC(CCCCN)C(=O)NC(Cc1cnc[nH]1)C(=O)NC(CC(N)=O)C(=O)NC1CSSCC(NC(=O)C(CCCNC(N)=N)NC(=O)C(CCCNC(N)=N)NC(=O)C(CCC(N)=O)NC(=O)C(CC(C)C)NC1=O)C(=O)NC(CCSC)C(=O)N1CCCC1C(=O)NC(CC(C)C)C(=O)NC(Cc1cnc[nH]1)C(=O)NC(CCCNC(N)=N)C(=O)NC(CO)C(=O)NC(C(C)C)C(=O)N1CCCC1C(=O)NC(Cc1ccccc1)C(=O)N1CCCC1C(O)=O
Show InChI InChI=1S/C170H286N62O39S4/c1-86(2)70-109(214-136(243)96(36-19-21-55-171)202-132(239)98(38-23-57-192-164(176)177)204-134(241)100(40-25-59-194-166(180)181)207-142(249)106(53-68-272-14)211-158(265)131(92(13)234)228-150(257)112(73-89(7)8)215-148(255)116(78-127(175)237)221-157(264)129(90(9)10)226-156(263)123-47-31-65-230(123)159(266)107(44-29-63-198-170(188)189)212-140(247)104-50-52-128(238)201-104)143(250)208-101(41-26-60-195-167(182)183)135(242)203-97(37-20-22-56-172)137(244)217-114(76-95-80-191-85-200-95)147(254)219-115(77-126(174)236)149(256)225-120-83-275-274-82-119(224-139(246)103(43-28-62-197-169(186)187)205-133(240)99(39-24-58-193-165(178)179)206-141(248)105(49-51-125(173)235)210-144(251)110(71-87(3)4)216-153(120)260)152(259)213-108(54-69-273-15)160(267)229-64-30-45-121(229)154(261)220-111(72-88(5)6)145(252)218-113(75-94-79-190-84-199-94)146(253)209-102(42-27-61-196-168(184)185)138(245)223-118(81-233)151(258)227-130(91(11)12)162(269)231-66-32-46-122(231)155(262)222-117(74-93-34-17-16-18-35-93)161(268)232-67-33-48-124(232)163(270)271/h16-18,34-35,79-80,84-92,96-124,129-131,233-234H,19-33,36-78,81-83,171-172H2,1-15H3,(H2,173,235)(H2,174,236)(H2,175,237)(H,190,199)(H,191,200)(H,201,238)(H,202,239)(H,203,242)(H,204,241)(H,205,240)(H,206,248)(H,207,249)(H,208,250)(H,209,253)(H,210,251)(H,211,265)(H,212,247)(H,213,259)(H,214,243)(H,215,255)(H,216,260)(H,217,244)(H,218,252)(H,219,254)(H,220,261)(H,221,264)(H,222,262)(H,223,245)(H,224,246)(H,225,256)(H,226,263)(H,227,258)(H,228,257)(H,270,271)(H4,176,177,192)(H4,178,179,193)(H4,180,181,194)(H4,182,183,195)(H4,184,185,196)(H4,186,187,197)(H4,188,189,198)/t92?,96-,97-,98-,99-,100?,101-,102-,103-,104?,105?,106?,107-,108-,109-,110-,111-,112-,113-,114-,115-,116-,117-,118?,119-,120-,121-,122-,123-,124-,129-,130-,131-/m0/s1
Reactome pathway
n/an/an/an/a 10n/an/an/an/a
Universit£ de Sherbrooke
Curated by ChEMBL
Assay Description
Induction of HA-tagged human APJ receptor internalization expressed in HEK-293 cells after 30 mins by ELISA
J Med Chem 59: 2962-72 (2016)
BindingDB Entry DOI: 10.7270/Q23N258H
Apelin receptor
(Homo sapiens (Human))
BDBM50172370
(CHEMBL3809767)
Show SMILES CSCCC(NC(=O)C(NC(=O)C(CC(C)C)NC(=O)C(CC(N)=O)NC(=O)C(NC(=O)C1CCCN1C(=O)C(CCCNC(N)=N)NC(=O)C1CCC(=O)N1)C(C)C)C(C)O)C(=O)NC(CCCNC(N)=N)C(=O)NC(CCCNC(N)=N)C(=O)NC(CCCCN)C(=O)NC(CC(C)C)C(=O)NC(CCCNC(N)=N)C(=O)NC(CCCCN)C(=O)NC(Cc1cnc[nH]1)C(=O)NC(CC(N)=O)C(=O)NC1CSSCC(NC(=O)C(CCCNC(N)=N)NC(=O)C(CCCNC(N)=N)NC(=O)C(CCC(N)=O)NC(=O)C(CC(C)C)NC1=O)C(=O)NC(CCSC)C(=O)N1CCCC1C(=O)NC(CC(C)C)C(=O)NC(Cc1cnc[nH]1)C(=O)NC(CCCNC(N)=N)C(=O)NC(CO)C(=O)NC(C(C)C)C(=O)N1CCCC1C(=O)NC(Cc1ccccc1)C(=O)N1CCCC1C(O)=O
Show InChI InChI=1S/C170H286N62O39S4/c1-86(2)70-109(214-136(243)96(36-19-21-55-171)202-132(239)98(38-23-57-192-164(176)177)204-134(241)100(40-25-59-194-166(180)181)207-142(249)106(53-68-272-14)211-158(265)131(92(13)234)228-150(257)112(73-89(7)8)215-148(255)116(78-127(175)237)221-157(264)129(90(9)10)226-156(263)123-47-31-65-230(123)159(266)107(44-29-63-198-170(188)189)212-140(247)104-50-52-128(238)201-104)143(250)208-101(41-26-60-195-167(182)183)135(242)203-97(37-20-22-56-172)137(244)217-114(76-95-80-191-85-200-95)147(254)219-115(77-126(174)236)149(256)225-120-83-275-274-82-119(224-139(246)103(43-28-62-197-169(186)187)205-133(240)99(39-24-58-193-165(178)179)206-141(248)105(49-51-125(173)235)210-144(251)110(71-87(3)4)216-153(120)260)152(259)213-108(54-69-273-15)160(267)229-64-30-45-121(229)154(261)220-111(72-88(5)6)145(252)218-113(75-94-79-190-84-199-94)146(253)209-102(42-27-61-196-168(184)185)138(245)223-118(81-233)151(258)227-130(91(11)12)162(269)231-66-32-46-122(231)155(262)222-117(74-93-34-17-16-18-35-93)161(268)232-67-33-48-124(232)163(270)271/h16-18,34-35,79-80,84-92,96-124,129-131,233-234H,19-33,36-78,81-83,171-172H2,1-15H3,(H2,173,235)(H2,174,236)(H2,175,237)(H,190,199)(H,191,200)(H,201,238)(H,202,239)(H,203,242)(H,204,241)(H,205,240)(H,206,248)(H,207,249)(H,208,250)(H,209,253)(H,210,251)(H,211,265)(H,212,247)(H,213,259)(H,214,243)(H,215,255)(H,216,260)(H,217,244)(H,218,252)(H,219,254)(H,220,261)(H,221,264)(H,222,262)(H,223,245)(H,224,246)(H,225,256)(H,226,263)(H,227,258)(H,228,257)(H,270,271)(H4,176,177,192)(H4,178,179,193)(H4,180,181,194)(H4,182,183,195)(H4,184,185,196)(H4,186,187,197)(H4,188,189,198)/t92?,96-,97-,98-,99-,100?,101-,102-,103-,104?,105?,106?,107-,108-,109-,110-,111-,112-,113-,114-,115-,116-,117-,118?,119-,120-,121-,122-,123-,124-,129-,130-,131-/m0/s1
Reactome pathway
n/an/an/an/a 5.30n/an/an/an/a
Universit£ de Sherbrooke
Curated by ChEMBL
Assay Description
Agonist activity at human APJ receptor expressed in HEK-293 cells assessed as dissociation of G-alpha-i1 protein after 5 mins by BRET assay
J Med Chem 59: 2962-72 (2016)
BindingDB Entry DOI: 10.7270/Q23N258H
Apelin receptor
(Homo sapiens (Human))
BDBM50172370
(CHEMBL3809767)
Show SMILES CSCCC(NC(=O)C(NC(=O)C(CC(C)C)NC(=O)C(CC(N)=O)NC(=O)C(NC(=O)C1CCCN1C(=O)C(CCCNC(N)=N)NC(=O)C1CCC(=O)N1)C(C)C)C(C)O)C(=O)NC(CCCNC(N)=N)C(=O)NC(CCCNC(N)=N)C(=O)NC(CCCCN)C(=O)NC(CC(C)C)C(=O)NC(CCCNC(N)=N)C(=O)NC(CCCCN)C(=O)NC(Cc1cnc[nH]1)C(=O)NC(CC(N)=O)C(=O)NC1CSSCC(NC(=O)C(CCCNC(N)=N)NC(=O)C(CCCNC(N)=N)NC(=O)C(CCC(N)=O)NC(=O)C(CC(C)C)NC1=O)C(=O)NC(CCSC)C(=O)N1CCCC1C(=O)NC(CC(C)C)C(=O)NC(Cc1cnc[nH]1)C(=O)NC(CCCNC(N)=N)C(=O)NC(CO)C(=O)NC(C(C)C)C(=O)N1CCCC1C(=O)NC(Cc1ccccc1)C(=O)N1CCCC1C(O)=O
Show InChI InChI=1S/C170H286N62O39S4/c1-86(2)70-109(214-136(243)96(36-19-21-55-171)202-132(239)98(38-23-57-192-164(176)177)204-134(241)100(40-25-59-194-166(180)181)207-142(249)106(53-68-272-14)211-158(265)131(92(13)234)228-150(257)112(73-89(7)8)215-148(255)116(78-127(175)237)221-157(264)129(90(9)10)226-156(263)123-47-31-65-230(123)159(266)107(44-29-63-198-170(188)189)212-140(247)104-50-52-128(238)201-104)143(250)208-101(41-26-60-195-167(182)183)135(242)203-97(37-20-22-56-172)137(244)217-114(76-95-80-191-85-200-95)147(254)219-115(77-126(174)236)149(256)225-120-83-275-274-82-119(224-139(246)103(43-28-62-197-169(186)187)205-133(240)99(39-24-58-193-165(178)179)206-141(248)105(49-51-125(173)235)210-144(251)110(71-87(3)4)216-153(120)260)152(259)213-108(54-69-273-15)160(267)229-64-30-45-121(229)154(261)220-111(72-88(5)6)145(252)218-113(75-94-79-190-84-199-94)146(253)209-102(42-27-61-196-168(184)185)138(245)223-118(81-233)151(258)227-130(91(11)12)162(269)231-66-32-46-122(231)155(262)222-117(74-93-34-17-16-18-35-93)161(268)232-67-33-48-124(232)163(270)271/h16-18,34-35,79-80,84-92,96-124,129-131,233-234H,19-33,36-78,81-83,171-172H2,1-15H3,(H2,173,235)(H2,174,236)(H2,175,237)(H,190,199)(H,191,200)(H,201,238)(H,202,239)(H,203,242)(H,204,241)(H,205,240)(H,206,248)(H,207,249)(H,208,250)(H,209,253)(H,210,251)(H,211,265)(H,212,247)(H,213,259)(H,214,243)(H,215,255)(H,216,260)(H,217,244)(H,218,252)(H,219,254)(H,220,261)(H,221,264)(H,222,262)(H,223,245)(H,224,246)(H,225,256)(H,226,263)(H,227,258)(H,228,257)(H,270,271)(H4,176,177,192)(H4,178,179,193)(H4,180,181,194)(H4,182,183,195)(H4,184,185,196)(H4,186,187,197)(H4,188,189,198)/t92?,96-,97-,98-,99-,100?,101-,102-,103-,104?,105?,106?,107-,108-,109-,110-,111-,112-,113-,114-,115-,116-,117-,118?,119-,120-,121-,122-,123-,124-,129-,130-,131-/m0/s1
Reactome pathway
n/an/an/an/a 45n/an/an/an/a
Universit£ de Sherbrooke
Curated by ChEMBL
Assay Description
Agonist activity at human APJ receptor expressed in HEK-293 cells assessed as beta-arrestin2 recruitment after 30 mins by BRET assay
J Med Chem 59: 2962-72 (2016)
BindingDB Entry DOI: 10.7270/Q23N258H