null
SMILES: CCN1CCN(CC1)c1cc(C)c2cc(NC(=O)Cc3ccc(Cl)c(Cl)c3)ccc2n1
InChI Key: InChIKey=IKUBXUCJQADOPH-UHFFFAOYSA-N
Activity Spreadsheet -- Enzyme Inhibition Constant Data from BindingDB
Found 1 hit for monomerid = 50172417
Trg + Lig
Ki
nM
ΔG°
kcal/mole
IC50
nM
Kd
nM
EC50/IC50
nM
koff
s-1
kon
M-1s-1
pHTemp
°C
Melanin-concentrating hormone receptor 1
(Homo sapiens (Human))
BDBM50172417
(2-(3,4-Dichloro-phenyl)-N-[2-(4-ethyl-piperazin-1-...)
Show SMILES CCN1CCN(CC1)c1cc(C)c2cc(NC(=O)Cc3ccc(Cl)c(Cl)c3)ccc2n1
Show InChI InChI=1S/C24H26Cl2N4O/c1-3-29-8-10-30(11-9-29)23-12-16(2)19-15-18(5-7-22(19)28-23)27-24(31)14-17-4-6-20(25)21(26)13-17/h4-7,12-13,15H,3,8-11,14H2,1-2H3,(H,27,31)
Reactome pathway
n/an/a 7.27E+5n/an/an/an/an/an/a
7TM Pharma A/S
Curated by ChEMBL
Assay Description
Displacement of 150p M [125I]-MCH from human MCH1R expressed in CHO-K1 cells
J Med Chem 48: 5684-97 (2005)
Article DOI: 10.1021/jm050103y
BindingDB Entry DOI: 10.7270/Q2H41QZ8