BDBM50172871 (S)-2-(3-Benzylamino-propyl)-10,10a-dihydro-5H-imidazo[1,5-b]isoquinoline-1,3-dione::CHEMBL196988
SMILES: Oc1c2Cc3ccccc3Cn2c(=O)n1CCCNCc1ccccc1
InChI Key: InChIKey=YZSDBYCCBZUADC-UHFFFAOYSA-N
Data: 1 IC50
Activity Spreadsheet -- Enzyme Inhibition Constant Data from BindingDB
Found 1 hit for monomerid = 50172871
Trg + Lig
Ki
nM
ΔG°
kcal/mole
IC50
nM
Kd
nM
EC50/IC50
nM
koff
s-1
kon
M-1s-1
pHTemp
°C
Sigma non-opioid intracellular receptor 1
(Homo sapiens (Human))
BDBM50172871
((S)-2-(3-Benzylamino-propyl)-10,10a-dihydro-5H-imi...)
Show SMILES Oc1c2Cc3ccccc3Cn2c(=O)n1CCCNCc1ccccc1
Show InChI InChI=1S/C21H23N3O2/c25-20-19-13-17-9-4-5-10-18(17)15-24(19)21(26)23(20)12-6-11-22-14-16-7-2-1-3-8-16/h1-5,7-10,22,25H,6,11-15H2
n/an/a 9.60n/an/an/an/a7.5n/a
Université de Lille II
Curated by ChEMBL
Assay Description
Inhibitory activity against opioid receptor sigma 1 in guinea pig cerebral cortex using [3H]-(+)-pentazocine as radio ligand at pH 7.5 for 150 min at...
Bioorg Med Chem Lett 15: 4828-32 (2005)
Article DOI: 10.1016/j.bmcl.2005.07.039
BindingDB Entry DOI: 10.7270/Q2TD9WW1