BDBM50172873 (S)-2-[3-(4-Phenyl-butylamino)-propyl]-10,10a-dihydro-5H-imidazo[1,5-b]isoquinoline-1,3-dione::CHEMBL371156
SMILES: Oc1c2Cc3ccccc3Cn2c(=O)n1CCCNCCCCc1ccccc1
InChI Key: InChIKey=NHEZPINUDOZOPY-UHFFFAOYSA-N
Data: 1 IC50
Activity Spreadsheet -- Enzyme Inhibition Constant Data from BindingDB
Found 1 hit for monomerid = 50172873
Trg + Lig
Ki
nM
ΔG°
kcal/mole
IC50
nM
Kd
nM
EC50/IC50
nM
koff
s-1
kon
M-1s-1
pHTemp
°C
Sigma non-opioid intracellular receptor 1
(Homo sapiens (Human))
BDBM50172873
((S)-2-[3-(4-Phenyl-butylamino)-propyl]-10,10a-dihy...)
Show SMILES Oc1c2Cc3ccccc3Cn2c(=O)n1CCCNCCCCc1ccccc1
Show InChI InChI=1S/C24H29N3O2/c28-23-22-17-20-12-4-5-13-21(20)18-27(22)24(29)26(23)16-8-15-25-14-7-6-11-19-9-2-1-3-10-19/h1-5,9-10,12-13,25,28H,6-8,11,14-18H2
n/an/a 10.5n/an/an/an/a7.5n/a
Université de Lille II
Curated by ChEMBL
Assay Description
Inhibitory activity against opioid receptor sigma 1 in guinea pig cerebral cortex using [3H]-(+)-pentazocine as radio ligand at pH 7.5 for 150 min at...
Bioorg Med Chem Lett 15: 4828-32 (2005)
Article DOI: 10.1016/j.bmcl.2005.07.039
BindingDB Entry DOI: 10.7270/Q2TD9WW1