BDBM50172874 (S)-2-{2-[Methyl-(5-phenyl-pentyl)-amino]-ethyl}-10,10a-dihydro-5H-imidazo[1,5-b]isoquinoline-1,3-dione::CHEMBL194738
SMILES: CN(CCCCCc1ccccc1)CCn1c(O)c2Cc3ccccc3Cn2c1=O
InChI Key: InChIKey=NZCZEWARNPACBN-UHFFFAOYSA-N
Data: 1 IC50
Activity Spreadsheet -- Enzyme Inhibition Constant Data from BindingDB
Found 1 hit for monomerid = 50172874
Trg + Lig
Ki
nM
ΔG°
kcal/mole
IC50
nM
Kd
nM
EC50/IC50
nM
koff
s-1
kon
M-1s-1
pHTemp
°C
Sigma non-opioid intracellular receptor 1
(Homo sapiens (Human))
BDBM50172874
((S)-2-{2-[Methyl-(5-phenyl-pentyl)-amino]-ethyl}-1...)
Show SMILES CN(CCCCCc1ccccc1)CCn1c(O)c2Cc3ccccc3Cn2c1=O
Show InChI InChI=1S/C25H31N3O2/c1-26(15-9-3-6-12-20-10-4-2-5-11-20)16-17-27-24(29)23-18-21-13-7-8-14-22(21)19-28(23)25(27)30/h2,4-5,7-8,10-11,13-14,29H,3,6,9,12,15-19H2,1H3
n/an/a 2.90n/an/an/an/a7.5n/a
Université de Lille II
Curated by ChEMBL
Assay Description
Inhibitory activity against opioid receptor sigma 1 in guinea pig cerebral cortex using [3H]-(+)-pentazocine as radio ligand at pH 7.5 for 150 min at...
Bioorg Med Chem Lett 15: 4828-32 (2005)
Article DOI: 10.1016/j.bmcl.2005.07.039
BindingDB Entry DOI: 10.7270/Q2TD9WW1