BDBM50173175 (8-Amino-2-furan-2-yl-[1,2,4]triazolo[1,5-a]pyrazin-6-yl)-(4-benzyl-piperazin-1-yl)-methanone::CHEMBL194451
SMILES: Nc1nc(cn2nc(nc12)-c1ccco1)C(=O)N1CCN(Cc2ccccc2)CC1
InChI Key: InChIKey=IOBVNJJVRBXKAE-UHFFFAOYSA-N
Data: 2 KI
Activity Spreadsheet -- Enzyme Inhibition Constant Data from BindingDB
Found 2 hits for monomerid = 50173175
Trg + Lig
Ki
nM
ΔG°
kcal/mole
IC50
nM
Kd
nM
EC50/IC50
nM
koff
s-1
kon
M-1s-1
pHTemp
°C
Adenosine receptor A1
(Rattus norvegicus (rat))
BDBM50173175
((8-Amino-2-furan-2-yl-[1,2,4]triazolo[1,5-a]pyrazi...)
Show SMILES Nc1nc(cn2nc(nc12)-c1ccco1)C(=O)N1CCN(Cc2ccccc2)CC1
Show InChI InChI=1S/C21H21N7O2/c22-18-20-24-19(17-7-4-12-30-17)25-28(20)14-16(23-18)21(29)27-10-8-26(9-11-27)13-15-5-2-1-3-6-15/h1-7,12,14H,8-11,13H2,(H2,22,23)
Reactome pathway
>250n/an/an/an/an/an/an/an/a
Biogen Idec, Inc.
Curated by ChEMBL
Assay Description
Binding affinity towards adenosine A1 receptor of rat cerebral cortex using [3H]-DPCPX compared to SCH-58261 (Ki=390 nM)
Bioorg Med Chem Lett 15: 4809-13 (2005)
Article DOI: 10.1016/j.bmcl.2005.07.052
BindingDB Entry DOI: 10.7270/Q24Q7TJV
Adenosine Receptors A2a (A2a)
(Rattus norvegicus (rat))
BDBM50173175
((8-Amino-2-furan-2-yl-[1,2,4]triazolo[1,5-a]pyrazi...)
Show SMILES Nc1nc(cn2nc(nc12)-c1ccco1)C(=O)N1CCN(Cc2ccccc2)CC1
Show InChI InChI=1S/C21H21N7O2/c22-18-20-24-19(17-7-4-12-30-17)25-28(20)14-16(23-18)21(29)27-10-8-26(9-11-27)13-15-5-2-1-3-6-15/h1-7,12,14H,8-11,13H2,(H2,22,23)
Reactome pathway
>250n/an/an/an/an/an/an/an/a
Biogen Idec, Inc.
Curated by ChEMBL
Assay Description
Binding affinity towards adenosine A2a receptor of rat brain homogenates using [3H]-ZM-241,385 compared to SCH-58261 (Ki=37 nM)
Bioorg Med Chem Lett 15: 4809-13 (2005)
Article DOI: 10.1016/j.bmcl.2005.07.052
BindingDB Entry DOI: 10.7270/Q24Q7TJV