BDBM50173178 2-Furan-2-yl-6-naphthalen-1-yl-[1,2,4]triazolo[1,5-a]pyrazin-8-ylamine::CHEMBL193572
SMILES: Nc1nc(cn2nc(nc12)-c1ccco1)-c1cccc2ccccc12
InChI Key: InChIKey=TYLVOLSRSSGIOX-UHFFFAOYSA-N
Data: 1 KI
Activity Spreadsheet -- Enzyme Inhibition Constant Data from BindingDB
Found 1 hit for monomerid = 50173178
Trg + Lig
Ki
nM
ΔG°
kcal/mole
IC50
nM
Kd
nM
EC50/IC50
nM
koff
s-1
kon
M-1s-1
pHTemp
°C
Adenosine Receptors A2a (A2a)
(Rattus norvegicus (rat))
BDBM50173178
(2-Furan-2-yl-6-naphthalen-1-yl-[1,2,4]triazolo[1,5...)
Show SMILES Nc1nc(cn2nc(nc12)-c1ccco1)-c1cccc2ccccc12
Show InChI InChI=1S/C19H13N5O/c20-17-19-22-18(16-9-4-10-25-16)23-24(19)11-15(21-17)14-8-3-6-12-5-1-2-7-13(12)14/h1-11H,(H2,20,21)
Reactome pathway
420n/an/an/an/an/an/an/an/a
Biogen Idec, Inc.
Curated by ChEMBL
Assay Description
Binding affinity towards adenosine A2a receptor of rat brain homogenates using [3H]-ZM-241,385 compared to SCH-58261 (Ki=37 nM)
Bioorg Med Chem Lett 15: 4809-13 (2005)
Article DOI: 10.1016/j.bmcl.2005.07.052
BindingDB Entry DOI: 10.7270/Q24Q7TJV