null
SMILES: O=C1N(Cc2ccccc2)c2ccccc2C11CCN(CC2CCCCCCC2)CC1
InChI Key: InChIKey=KNOVIPKRXOCVMF-UHFFFAOYSA-N
Activity Spreadsheet -- Enzyme Inhibition Constant Data from BindingDB
Found 4 hits for monomerid = 50173243
Trg + Lig
Ki
nM
ΔG°
kcal/mole
IC50
nM
Kd
nM
EC50/IC50
nM
koff
s-1
kon
M-1s-1
pHTemp
°C
Delta-type opioid receptor
(Homo sapiens (Human))
BDBM50173243
(1-benzyl-1'-cyclooctylmethylspiro[2,3-dihydro-1H-i...)
Show SMILES O=C1N(Cc2ccccc2)c2ccccc2C11CCN(CC2CCCCCCC2)CC1
Show InChI InChI=1S/C28H36N2O/c31-27-28(17-19-29(20-18-28)21-23-11-5-2-1-3-6-12-23)25-15-9-10-16-26(25)30(27)22-24-13-7-4-8-14-24/h4,7-10,13-16,23H,1-3,5-6,11-12,17-22H2
Reactome pathway
n/an/a>1.00E+4n/an/an/an/an/an/a
Johnson & Johnson Pharmaceutical Research and Development
Curated by ChEMBL
Assay Description
Binding affinity against human opioid receptor delta 1 expressed in HEK293 cells using [3H]DDPDE radioligand
Bioorg Med Chem Lett 15: 5022-6 (2005)
Article DOI: 10.1016/j.bmcl.2005.08.009
BindingDB Entry DOI: 10.7270/Q2RF5TKC
Nociceptin receptor
(Homo sapiens (Human))
BDBM50173243
(1-benzyl-1'-cyclooctylmethylspiro[2,3-dihydro-1H-i...)
Show SMILES O=C1N(Cc2ccccc2)c2ccccc2C11CCN(CC2CCCCCCC2)CC1
Show InChI InChI=1S/C28H36N2O/c31-27-28(17-19-29(20-18-28)21-23-11-5-2-1-3-6-12-23)25-15-9-10-16-26(25)30(27)22-24-13-7-4-8-14-24/h4,7-10,13-16,23H,1-3,5-6,11-12,17-22H2
Reactome pathway
n/an/a 120n/an/an/an/an/an/a
Johnson & Johnson Pharmaceutical Research and Development
Curated by ChEMBL
Assay Description
Binding affinity determined by the ability to compete with [125I]-Tyr14- nociceptin from binding to human opiate receptor-like 1 expressed in HEK293 ...
Bioorg Med Chem Lett 15: 5022-6 (2005)
Article DOI: 10.1016/j.bmcl.2005.08.009
BindingDB Entry DOI: 10.7270/Q2RF5TKC
Mu-type opioid receptor
(Homo sapiens (Human))
BDBM50173243
(1-benzyl-1'-cyclooctylmethylspiro[2,3-dihydro-1H-i...)
Show SMILES O=C1N(Cc2ccccc2)c2ccccc2C11CCN(CC2CCCCCCC2)CC1
Show InChI InChI=1S/C28H36N2O/c31-27-28(17-19-29(20-18-28)21-23-11-5-2-1-3-6-12-23)25-15-9-10-16-26(25)30(27)22-24-13-7-4-8-14-24/h4,7-10,13-16,23H,1-3,5-6,11-12,17-22H2
NCI pathway
Reactome pathway
n/an/a 960n/an/an/an/an/an/a
Johnson & Johnson Pharmaceutical Research and Development
Curated by ChEMBL
Assay Description
Binding affinity against human opioid receptor mu 1 expressed in HEK293 cells using [3H]DAMGO radioligand
Bioorg Med Chem Lett 15: 5022-6 (2005)
Article DOI: 10.1016/j.bmcl.2005.08.009
BindingDB Entry DOI: 10.7270/Q2RF5TKC
Kappa-type opioid receptor
(Homo sapiens (Human))
BDBM50173243
(1-benzyl-1'-cyclooctylmethylspiro[2,3-dihydro-1H-i...)
Show SMILES O=C1N(Cc2ccccc2)c2ccccc2C11CCN(CC2CCCCCCC2)CC1
Show InChI InChI=1S/C28H36N2O/c31-27-28(17-19-29(20-18-28)21-23-11-5-2-1-3-6-12-23)25-15-9-10-16-26(25)30(27)22-24-13-7-4-8-14-24/h4,7-10,13-16,23H,1-3,5-6,11-12,17-22H2
Reactome pathway
n/an/a 1.10E+3n/an/an/an/an/an/a
Johnson & Johnson Pharmaceutical Research and Development
Curated by ChEMBL
Assay Description
Binding affinity against human opioid receptor kappa 1 expressed in HEK293 cells using 3H-U69,593 radioligand
Bioorg Med Chem Lett 15: 5022-6 (2005)
Article DOI: 10.1016/j.bmcl.2005.08.009
BindingDB Entry DOI: 10.7270/Q2RF5TKC