BDBM50173261 CHEMBL198099::methyl 2-[1'-cyclohexylmethyl-2-oxospiro[2,3-dihydro-1H-indole-3,4'-(hexahydropyridine)]-1-yl]acetate
SMILES: COC(=O)CN1C(=O)C2(CCN(CC3CCCCC3)CC2)c2ccccc12
InChI Key: InChIKey=XFHYENOGWKYKLE-UHFFFAOYSA-N
Data: 1 IC50
Activity Spreadsheet -- Enzyme Inhibition Constant Data from BindingDB
Found 1 hit for monomerid = 50173261
Trg + Lig
Ki
nM
ΔG°
kcal/mole
IC50
nM
Kd
nM
EC50/IC50
nM
koff
s-1
kon
M-1s-1
pHTemp
°C
Nociceptin receptor
(Homo sapiens (Human))
BDBM50173261
(CHEMBL198099 | methyl 2-[1'-cyclohexylmethyl-2-oxo...)
Show SMILES COC(=O)CN1C(=O)C2(CCN(CC3CCCCC3)CC2)c2ccccc12
Show InChI InChI=1S/C22H30N2O3/c1-27-20(25)16-24-19-10-6-5-9-18(19)22(21(24)26)11-13-23(14-12-22)15-17-7-3-2-4-8-17/h5-6,9-10,17H,2-4,7-8,11-16H2,1H3
Reactome pathway
n/an/a 800n/an/an/an/an/an/a
Johnson & Johnson Pharmaceutical Research and Development
Curated by ChEMBL
Assay Description
Binding affinity determined by the ability to compete with [125I]-Tyr14- nociceptin from binding to human opiate receptor-like 1 expressed in HEK293 ...
Bioorg Med Chem Lett 15: 5022-6 (2005)
Article DOI: 10.1016/j.bmcl.2005.08.009
BindingDB Entry DOI: 10.7270/Q2RF5TKC