BDBM50173486 4-(2-Oxo-benzooxazol-3-yl)-piperidine-1-carboxylic acid [(S)-1-[(R)-5-amino-1-(4-pyridin-4-yl-piperazine-1-carbonyl)-pentylcarbamoyl]-2-(3,5-dibromo-4-hydroxy-phenyl)-ethyl]-amide::CHEMBL198502
SMILES: NCCCC[C@@H](NC(=O)[C@H](Cc1cc(Br)c(O)c(Br)c1)NC(=O)N1CCC(CC1)n1c2ccccc2oc1=O)C(=O)N1CCN(CC1)c1ccncc1
InChI Key: InChIKey=PWPMKDORTALZSG-IHLOFXLRSA-N
Data: 1 IC50  1 Kd
Activity Spreadsheet -- Enzyme Inhibition Constant Data from BindingDB
Found 2 hits for monomerid = 50173486
Trg + Lig
Ki
nM
ΔG°
kcal/mole
IC50
nM
Kd
nM
EC50/IC50
nM
koff
s-1
kon
M-1s-1
pHTemp
°C
CGRP type 1 receptor
(Homo sapiens (Human))
BDBM50173486
(4-(2-Oxo-benzooxazol-3-yl)-piperidine-1-carboxylic...)
Show SMILES NCCCC[C@@H](NC(=O)[C@H](Cc1cc(Br)c(O)c(Br)c1)NC(=O)N1CCC(CC1)n1c2ccccc2oc1=O)C(=O)N1CCN(CC1)c1ccncc1
Show InChI InChI=1S/C37H44Br2N8O6/c38-27-21-24(22-28(39)33(27)48)23-30(43-36(51)46-15-10-26(11-16-46)47-31-6-1-2-7-32(31)53-37(47)52)34(49)42-29(5-3-4-12-40)35(50)45-19-17-44(18-20-45)25-8-13-41-14-9-25/h1-2,6-9,13-14,21-22,26,29-30,48H,3-5,10-12,15-20,23,40H2,(H,42,49)(H,43,51)/t29-,30+/m1/s1
n/an/an/a 10n/an/an/an/an/a
Boehringer Ingelheim Pharma GmbH & Co. KG
Curated by ChEMBL
Assay Description
Antagonistic activity against calcitonin gene related peptide receptor determined by measuring the formation of cyclic AMP in SK-N-MC cells
J Med Chem 48: 5921-31 (2005)
Article DOI: 10.1021/jm0490641
BindingDB Entry DOI: 10.7270/Q2KS6R3J
CGRP type 1 receptor
(Homo sapiens (Human))
BDBM50173486
(4-(2-Oxo-benzooxazol-3-yl)-piperidine-1-carboxylic...)
Show SMILES NCCCC[C@@H](NC(=O)[C@H](Cc1cc(Br)c(O)c(Br)c1)NC(=O)N1CCC(CC1)n1c2ccccc2oc1=O)C(=O)N1CCN(CC1)c1ccncc1
Show InChI InChI=1S/C37H44Br2N8O6/c38-27-21-24(22-28(39)33(27)48)23-30(43-36(51)46-15-10-26(11-16-46)47-31-6-1-2-7-32(31)53-37(47)52)34(49)42-29(5-3-4-12-40)35(50)45-19-17-44(18-20-45)25-8-13-41-14-9-25/h1-2,6-9,13-14,21-22,26,29-30,48H,3-5,10-12,15-20,23,40H2,(H,42,49)(H,43,51)/t29-,30+/m1/s1
n/an/a 44n/an/an/an/a7.4n/a
Boehringer Ingelheim Pharma GmbH & Co. KG
Curated by ChEMBL
Assay Description
Affinity against human calcitonin gene related peptide receptor (1 uM) expressed in SK-N-MC cells using [125I]-CGRP as radioligand after 180 minutes ...
J Med Chem 48: 5921-31 (2005)
Article DOI: 10.1021/jm0490641
BindingDB Entry DOI: 10.7270/Q2KS6R3J