BDBM50173692 CHEMBL372302::[5-(3-Bromo-phenyl)-pyridazin-3-yl]-methyl-amine
SMILES: CNc1cc(cnn1)-c1cccc(Br)c1
InChI Key: InChIKey=RHPSRJBQHFLHNQ-UHFFFAOYSA-N
Data: 3 KI
Activity Spreadsheet -- Enzyme Inhibition Constant Data from BindingDB
Found 3 hits for monomerid = 50173692
Trg + Lig
Ki
nM
ΔG°
kcal/mole
IC50
nM
Kd
nM
EC50/IC50
nM
koff
s-1
kon
M-1s-1
pHTemp
°C
GABA receptor alpha-5/beta-3/gamma-2 subunit
(Homo sapiens (Human))
BDBM50173692
(CHEMBL372302 | [5-(3-Bromo-phenyl)-pyridazin-3-yl]...)
Show SMILES CNc1cc(cnn1)-c1cccc(Br)c1
Show InChI InChI=1S/C11H10BrN3/c1-13-11-6-9(7-14-15-11)8-3-2-4-10(12)5-8/h2-7H,1H3,(H,13,15)
27n/an/an/an/an/an/a7.4n/a
Merck Sharp & Dohme Research Laboratories
Curated by ChEMBL
Assay Description
Displacement of [3H]-Ro- 15-1788 binding from human recombinant Gamma-aminobutyric-acid A receptor alpha5-beta3-gamma2 expressed in mouse fibroblast ...
J Med Chem 48: 6004-11 (2005)
Article DOI: 10.1021/jm050249x
BindingDB Entry DOI: 10.7270/Q26H4GZH
GABA receptor alpha-1/beta-3/gamma-2 subunit
(Homo sapiens (Human))
BDBM50173692
(CHEMBL372302 | [5-(3-Bromo-phenyl)-pyridazin-3-yl]...)
Show SMILES CNc1cc(cnn1)-c1cccc(Br)c1
Show InChI InChI=1S/C11H10BrN3/c1-13-11-6-9(7-14-15-11)8-3-2-4-10(12)5-8/h2-7H,1H3,(H,13,15)
49n/an/an/an/an/an/a7.4n/a
Merck Sharp & Dohme Research Laboratories
Curated by ChEMBL
Assay Description
Displacement of [3H]-Ro- 15-1788 binding from human recombinant Gamma-aminobutyric-acid A receptor alpha1-beta3-gamma2 expressed in mouse fibroblast ...
J Med Chem 48: 6004-11 (2005)
Article DOI: 10.1021/jm050249x
BindingDB Entry DOI: 10.7270/Q26H4GZH
GABA receptor alpha-3/beta-3/gamma-2 subunit
(Homo sapiens (Human))
BDBM50173692
(CHEMBL372302 | [5-(3-Bromo-phenyl)-pyridazin-3-yl]...)
Show SMILES CNc1cc(cnn1)-c1cccc(Br)c1
Show InChI InChI=1S/C11H10BrN3/c1-13-11-6-9(7-14-15-11)8-3-2-4-10(12)5-8/h2-7H,1H3,(H,13,15)
113n/an/an/an/an/an/a7.4n/a
Merck Sharp & Dohme Research Laboratories
Curated by ChEMBL
Assay Description
Displacement of [3H]-Ro- 15-1788 binding from human recombinant Gamma-aminobutyric-acid A receptor alpha3-beta3-gamma2 expressed in mouse fibroblast ...
J Med Chem 48: 6004-11 (2005)
Article DOI: 10.1021/jm050249x
BindingDB Entry DOI: 10.7270/Q26H4GZH