BDBM50173699 4-(6-Phenyl-pyridazin-4-yl)-benzonitrile::CHEMBL198358
SMILES: N#Cc1ccc(cc1)-c1cnnc(c1)-c1ccccc1
InChI Key: InChIKey=YICWHQNQWIQUMG-UHFFFAOYSA-N
Data: 3 KI
Activity Spreadsheet -- Enzyme Inhibition Constant Data from BindingDB
Found 3 hits for monomerid = 50173699
Trg + Lig
Ki
nM
ΔG°
kcal/mole
IC50
nM
Kd
nM
EC50/IC50
nM
koff
s-1
kon
M-1s-1
pHTemp
°C
GABA receptor alpha-1/beta-3/gamma-2 subunit
(Homo sapiens (Human))
BDBM50173699
(4-(6-Phenyl-pyridazin-4-yl)-benzonitrile | CHEMBL1...)
Show SMILES N#Cc1ccc(cc1)-c1cnnc(c1)-c1ccccc1
Show InChI InChI=1S/C17H11N3/c18-11-13-6-8-14(9-7-13)16-10-17(20-19-12-16)15-4-2-1-3-5-15/h1-10,12H
27n/an/an/an/an/an/a7.4n/a
Merck Sharp & Dohme Research Laboratories
Curated by ChEMBL
Assay Description
Displacement of [3H]-Ro- 15-1788 binding from human recombinant Gamma-aminobutyric-acid A receptor alpha1-beta3-gamma2 expressed in mouse fibroblast ...
J Med Chem 48: 6004-11 (2005)
Article DOI: 10.1021/jm050249x
BindingDB Entry DOI: 10.7270/Q26H4GZH
GABA receptor alpha-5/beta-3/gamma-2 subunit
(Homo sapiens (Human))
BDBM50173699
(4-(6-Phenyl-pyridazin-4-yl)-benzonitrile | CHEMBL1...)
Show SMILES N#Cc1ccc(cc1)-c1cnnc(c1)-c1ccccc1
Show InChI InChI=1S/C17H11N3/c18-11-13-6-8-14(9-7-13)16-10-17(20-19-12-16)15-4-2-1-3-5-15/h1-10,12H
56n/an/an/an/an/an/a7.4n/a
Merck Sharp & Dohme Research Laboratories
Curated by ChEMBL
Assay Description
Displacement of [3H]-Ro- 15-1788 binding from human recombinant Gamma-aminobutyric-acid A receptor alpha5-beta3-gamma2 expressed in mouse fibroblast ...
J Med Chem 48: 6004-11 (2005)
Article DOI: 10.1021/jm050249x
BindingDB Entry DOI: 10.7270/Q26H4GZH
GABA receptor alpha-3/beta-3/gamma-2 subunit
(Homo sapiens (Human))
BDBM50173699
(4-(6-Phenyl-pyridazin-4-yl)-benzonitrile | CHEMBL1...)
Show SMILES N#Cc1ccc(cc1)-c1cnnc(c1)-c1ccccc1
Show InChI InChI=1S/C17H11N3/c18-11-13-6-8-14(9-7-13)16-10-17(20-19-12-16)15-4-2-1-3-5-15/h1-10,12H
81n/an/an/an/an/an/a7.4n/a
Merck Sharp & Dohme Research Laboratories
Curated by ChEMBL
Assay Description
Displacement of [3H]-Ro- 15-1788 binding from human recombinant Gamma-aminobutyric-acid A receptor alpha3-beta3-gamma2 expressed in mouse fibroblast ...
J Med Chem 48: 6004-11 (2005)
Article DOI: 10.1021/jm050249x
BindingDB Entry DOI: 10.7270/Q26H4GZH