BDBM50173829 4-(3-chloro-4-fluorophenylamino)-6-(3-(pyrrolidin-1-yl)propylamino)-1,7-naphthyridine-3-carbonitrile::CHEMBL425213
SMILES: Fc1ccc(Nc2c(cnc3cnc(NCCCN4CCCC4)cc23)C#N)cc1Cl
InChI Key: InChIKey=QAESMTHQNRYDHM-UHFFFAOYSA-N
Data: 1 IC50
Activity Spreadsheet -- Enzyme Inhibition Constant Data from BindingDB
Found 1 hit for monomerid = 50173829
Trg + Lig
Ki
nM
ΔG°
kcal/mole
IC50
nM
Kd
nM
EC50/IC50
nM
koff
s-1
kon
M-1s-1
pHTemp
°C
Mitogen-activated protein kinase kinase kinase 8
(Homo sapiens (Human))
BDBM50173829
(4-(3-chloro-4-fluorophenylamino)-6-(3-(pyrrolidin-...)
Show SMILES Fc1ccc(Nc2c(cnc3cnc(NCCCN4CCCC4)cc23)C#N)cc1Cl
Show InChI InChI=1S/C22H22ClFN6/c23-18-10-16(4-5-19(18)24)29-22-15(12-25)13-27-20-14-28-21(11-17(20)22)26-6-3-9-30-7-1-2-8-30/h4-5,10-11,13-14H,1-3,6-9H2,(H,26,28)(H,27,29)
NCI pathway
Reactome pathway
n/an/a 3.57E+3n/an/an/an/an/an/a
Wyeth Research
Curated by ChEMBL
Assay Description
Inhibitory activity against human Tpl2 kinase via quantification of MEK phosphorylation
Bioorg Med Chem Lett 15: 5288-92 (2005)
Article DOI: 10.1016/j.bmcl.2005.08.029
BindingDB Entry DOI: 10.7270/Q2JS9Q0M