null
SMILES: O[C@@H]1C=C[C@@]2(C[C@H]1O[C@@H](C2)C(O)=O)C(O)=O
InChI Key: InChIKey=KRZHNRULRHECRF-JQCUSGDOSA-N
Activity Spreadsheet -- Enzyme Inhibition Constant Data from BindingDB
Found 1 hit for monomerid = 50173884
Trg + Lig
Ki
nM
ΔG°
kcal/mole
IC50
nM
Kd
nM
EC50/IC50
nM
koff
s-1
kon
M-1s-1
pHTemp
°C
Histone deacetylase 2b
(Zea mays)
BDBM50173884
((1R,3S,5S,8R)-8-HYDROXY-2-OXABICYCLO[3.3.1]NON-6-E...)
Show SMILES O[C@@H]1C=C[C@@]2(C[C@H]1O[C@@H](C2)C(O)=O)C(O)=O |c:2,TLB:0:1:7.8.9:5|
Show InChI InChI=1S/C10H12O6/c11-5-1-2-10(9(14)15)3-6(5)16-7(4-10)8(12)13/h1-2,5-7,11H,3-4H2,(H,12,13)(H,14,15)/t5-,6-,7+,10+/m1/s1
n/an/a 7n/an/an/an/an/an/a
Università degli Studi di Roma La Sapienza
Curated by ChEMBL
Assay Description
Inhibitory concentration against Histone deacetylase 2 in maize
Bioorg Med Chem Lett 15: 4656-61 (2005)
Article DOI: 10.1016/j.bmcl.2005.07.081
BindingDB Entry DOI: 10.7270/Q29886JV