null
SMILES: Cc1c(CC(O)=O)c2cc(F)ccc2n1S(=O)(=O)c1ccc(C)cc1
InChI Key: InChIKey=UNZRWCRCVPJLCE-UHFFFAOYSA-N
Activity Spreadsheet -- Enzyme Inhibition Constant Data from BindingDB
Found 3 hits for monomerid = 50174356
Trg + Lig
Ki
nM
ΔG°
kcal/mole
IC50
nM
Kd
nM
EC50/IC50
nM
koff
s-1
kon
M-1s-1
pHTemp
°C
Prostaglandin D2 receptor 2
(Homo sapiens (Human))
BDBM50174356
(CHEMBL193753 | [5-Fluoro-2-methyl-1-(toluene-4-sul...)
Show SMILES Cc1c(CC(O)=O)c2cc(F)ccc2n1S(=O)(=O)c1ccc(C)cc1
Show InChI InChI=1S/C18H16FNO4S/c1-11-3-6-14(7-4-11)25(23,24)20-12(2)15(10-18(21)22)16-9-13(19)5-8-17(16)20/h3-9H,10H2,1-2H3,(H,21,22)
Reactome pathway
457n/an/an/an/an/an/an/an/a
Oxagen Ltd.
Curated by ChEMBL
Assay Description
Binding affinity towards human CRTH2 receptor expressed in CHO cells
J Med Chem 48: 6174-7 (2005)
Article DOI: 10.1021/jm050519b
BindingDB Entry DOI: 10.7270/Q2KK9B9B
Prostaglandin D2 receptor
(Homo sapiens (Human))
BDBM50174356
(CHEMBL193753 | [5-Fluoro-2-methyl-1-(toluene-4-sul...)
Show SMILES Cc1c(CC(O)=O)c2cc(F)ccc2n1S(=O)(=O)c1ccc(C)cc1
Show InChI InChI=1S/C18H16FNO4S/c1-11-3-6-14(7-4-11)25(23,24)20-12(2)15(10-18(21)22)16-9-13(19)5-8-17(16)20/h3-9H,10H2,1-2H3,(H,21,22)
>1.00E+4n/an/an/an/an/an/an/an/a
Oxagen Ltd.
Curated by ChEMBL
Assay Description
Binding affinity towards human DP receptor expressed in CHO cells
J Med Chem 48: 6174-7 (2005)
Article DOI: 10.1021/jm050519b
BindingDB Entry DOI: 10.7270/Q2KK9B9B
Prostaglandin D2 receptor 2
(Homo sapiens (Human))
BDBM50174356
(CHEMBL193753 | [5-Fluoro-2-methyl-1-(toluene-4-sul...)
Show SMILES Cc1c(CC(O)=O)c2cc(F)ccc2n1S(=O)(=O)c1ccc(C)cc1
Show InChI InChI=1S/C18H16FNO4S/c1-11-3-6-14(7-4-11)25(23,24)20-12(2)15(10-18(21)22)16-9-13(19)5-8-17(16)20/h3-9H,10H2,1-2H3,(H,21,22)
Reactome pathway
n/an/a 2.18E+3n/an/an/an/an/an/a
Oxagen Ltd.
Curated by ChEMBL
Assay Description
Concentration required to inhibit PGD-2 (10 nM) stimulated [Ca2+] flux in CHO cells expressing human CRTH2 receptor
J Med Chem 48: 6174-7 (2005)
Article DOI: 10.1021/jm050519b
BindingDB Entry DOI: 10.7270/Q2KK9B9B