BDBM50174695 CHEMBL199476::N-[5-(10,11-dihydro-5-oxa-2,4,11-triaza-dibenzo[a,d]cyclohepten-1-ylamino)-pyrimidin-2-yl]-benzamide
SMILES: O=C(Nc1ncc(Nc2ncnc3Oc4ccccc4CNc23)cn1)c1ccccc1
InChI Key: InChIKey=RPOCGEOKWIOQID-UHFFFAOYSA-N
Data: 1 IC50
Activity Spreadsheet -- Enzyme Inhibition Constant Data from BindingDB
Found 1 hit for monomerid = 50174695
Trg + Lig
Ki
nM
ΔG°
kcal/mole
IC50
nM
Kd
nM
EC50/IC50
nM
koff
s-1
kon
M-1s-1
pHTemp
°C
Aurora kinase A
(Homo sapiens (Human))
BDBM50174695
(CHEMBL199476 | N-[5-(10,11-dihydro-5-oxa-2,4,11-tr...)
Show SMILES O=C(Nc1ncc(Nc2ncnc3Oc4ccccc4CNc23)cn1)c1ccccc1
Show InChI InChI=1S/C22H17N7O2/c30-20(14-6-2-1-3-7-14)29-22-24-11-16(12-25-22)28-19-18-21(27-13-26-19)31-17-9-5-4-8-15(17)10-23-18/h1-9,11-13,23H,10H2,(H,26,27,28)(H,24,25,29,30)
NCI pathway
Reactome pathway
n/an/a 1.90E+3n/an/an/an/an/an/a
ImClone Systems Inc
Curated by ChEMBL
Assay Description
Inhibitory activity against Aurora A kinase
Bioorg Med Chem Lett 15: 5474-7 (2005)
Article DOI: 10.1016/j.bmcl.2005.08.098
BindingDB Entry DOI: 10.7270/Q2S46RGS