null
SMILES: C[C@@H]1CCN(CCOc2ccc(cc2)[C@H]2[C@H](CCc3cc(O)ccc23)c2ccccc2)C1
InChI Key: InChIKey=JAVIIUAYGNOEAR-NRZUKODWSA-N
Activity Spreadsheet -- Enzyme Inhibition Constant Data from BindingDB
Found 2 hits for monomerid = 50174922
Trg + Lig
Ki
nM
ΔG°
kcal/mole
IC50
nM
Kd
nM
EC50/IC50
nM
koff
s-1
kon
M-1s-1
pHTemp
°C
Estrogen receptor
(Homo sapiens (Human))
BDBM50174922
((5R,6S)-5-(4-(2-((R)-3-methylpyrrolidin-1-yl)ethox...)
Show SMILES C[C@@H]1CCN(CCOc2ccc(cc2)[C@H]2[C@H](CCc3cc(O)ccc23)c2ccccc2)C1
Show InChI InChI=1S/C29H33NO2/c1-21-15-16-30(20-21)17-18-32-26-11-7-23(8-12-26)29-27(22-5-3-2-4-6-22)13-9-24-19-25(31)10-14-28(24)29/h2-8,10-12,14,19,21,27,29,31H,9,13,15-18,20H2,1H3/t21-,27-,29+/m1/s1
n/an/a 0.5n/an/an/an/an/an/a
Merck Research Laboratories
Curated by ChEMBL
Assay Description
Inhibition of binding to recombinant human ERalpha by scintillation proximity assay
Bioorg Med Chem Lett 15: 5124-8 (2005)
Article DOI: 10.1016/j.bmcl.2005.08.084
BindingDB Entry DOI: 10.7270/Q2BZ65MS
Estrogen receptor beta
(Homo sapiens (Human))
BDBM50174922
((5R,6S)-5-(4-(2-((R)-3-methylpyrrolidin-1-yl)ethox...)
Show SMILES C[C@@H]1CCN(CCOc2ccc(cc2)[C@H]2[C@H](CCc3cc(O)ccc23)c2ccccc2)C1
Show InChI InChI=1S/C29H33NO2/c1-21-15-16-30(20-21)17-18-32-26-11-7-23(8-12-26)29-27(22-5-3-2-4-6-22)13-9-24-19-25(31)10-14-28(24)29/h2-8,10-12,14,19,21,27,29,31H,9,13,15-18,20H2,1H3/t21-,27-,29+/m1/s1
n/an/a 0.600n/an/an/an/an/an/a
Merck Research Laboratories
Curated by ChEMBL
Assay Description
Inhibition of binding to recombinant human ERbeta by scintillation proximity assay
Bioorg Med Chem Lett 15: 5124-8 (2005)
Article DOI: 10.1016/j.bmcl.2005.08.084
BindingDB Entry DOI: 10.7270/Q2BZ65MS