BDBM50175079 (S,Z)-methyl 2-cyano-3-(2-methylbenzofuran-5-ylamino)-3-(2-oxo-1-(2-oxo-2-(pyrrolidin-1-yl)ethyl)azepan-3-ylamino)acrylate::CHEMBL426468
SMILES: COC(=O)C(C#N)C(N[C@H]1CCCCN(CC(=O)N2CCCC2)C1=O)=Nc1ccc2oc(C)cc2c1
InChI Key: InChIKey=OCSBLCNXYUFLSM-LBAQZLPGSA-N
Data: 1 IC50
Activity Spreadsheet -- Enzyme Inhibition Constant Data from BindingDB
Found 1 hit for monomerid = 50175079
Trg + Lig
Ki
nM
ΔG°
kcal/mole
IC50
nM
Kd
nM
EC50/IC50
nM
koff
s-1
kon
M-1s-1
pHTemp
°C
Coagulation factor X
(Homo sapiens (Human))
BDBM50175079
((S,Z)-methyl 2-cyano-3-(2-methylbenzofuran-5-ylami...)
Show SMILES COC(=O)C(C#N)C(N[C@H]1CCCCN(CC(=O)N2CCCC2)C1=O)=Nc1ccc2oc(C)cc2c1 |w:25.27|
Show InChI InChI=1S/C26H31N5O5/c1-17-13-18-14-19(8-9-22(18)36-17)28-24(20(15-27)26(34)35-2)29-21-7-3-4-12-31(25(21)33)16-23(32)30-10-5-6-11-30/h8-9,13-14,20-21H,3-7,10-12,16H2,1-2H3,(H,28,29)/t20?,21-/m0/s1
Reactome pathway
n/an/a 20n/an/an/an/an/an/a
Bristol-Myers Squibb Pharmaceutical Research Institute
Curated by ChEMBL
Assay Description
Inhibitory activity against human FXa
Bioorg Med Chem Lett 15: 5453-8 (2005)
Article DOI: 10.1016/j.bmcl.2005.08.107
BindingDB Entry DOI: 10.7270/Q2KH0MW5