BDBM50175088 (S,Z)-2-(isopropylsulfonyl)-3-(2-methylbenzofuran-5-ylamino)-3-(2-oxo-1-(2-oxo-2-(pyrrolidin-1-yl)ethyl)azepan-3-ylamino)acrylonitrile::CHEMBL370231
SMILES: CC(C)S(=O)(=O)C(C#N)C(N[C@H]1CCCCN(CC(=O)N2CCCC2)C1=O)=Nc1ccc2oc(C)cc2c1
InChI Key: InChIKey=NKTUVNYXUMSYCZ-OWJIYDKWSA-N
Data: 1 IC50
Activity Spreadsheet -- Enzyme Inhibition Constant Data from BindingDB
Found 1 hit for monomerid = 50175088
Trg + Lig
Ki
nM
ΔG°
kcal/mole
IC50
nM
Kd
nM
EC50/IC50
nM
koff
s-1
kon
M-1s-1
pHTemp
°C
Coagulation factor X
(Homo sapiens (Human))
BDBM50175088
((S,Z)-2-(isopropylsulfonyl)-3-(2-methylbenzofuran-...)
Show SMILES CC(C)S(=O)(=O)C(C#N)C(N[C@H]1CCCCN(CC(=O)N2CCCC2)C1=O)=Nc1ccc2oc(C)cc2c1 |w:27.29|
Show InChI InChI=1S/C27H35N5O5S/c1-18(2)38(35,36)24(16-28)26(29-21-9-10-23-20(15-21)14-19(3)37-23)30-22-8-4-5-13-32(27(22)34)17-25(33)31-11-6-7-12-31/h9-10,14-15,18,22,24H,4-8,11-13,17H2,1-3H3,(H,29,30)/t22-,24?/m0/s1
Reactome pathway
n/an/a 647n/an/an/an/an/an/a
Bristol-Myers Squibb Pharmaceutical Research Institute
Curated by ChEMBL
Assay Description
Inhibitory activity against human FXa
Bioorg Med Chem Lett 15: 5453-8 (2005)
Article DOI: 10.1016/j.bmcl.2005.08.107
BindingDB Entry DOI: 10.7270/Q2KH0MW5