BDBM50175093 (S,Z)-2-(4-chlorobenzoyl)-3-(2-methylbenzofuran-5-ylamino)-3-(2-oxo-1-(2-oxo-2-(pyrrolidin-1-yl)ethyl)azepan-3-ylamino)acrylonitrile::CHEMBL198970
SMILES: Cc1cc2cc(ccc2o1)N=C(N[C@H]1CCCCN(CC(=O)N2CCCC2)C1=O)C(C#N)C(=O)c1ccc(Cl)cc1
InChI Key: InChIKey=IWVCQOZGXQQUGQ-AMVUTOCUSA-N
Data: 1 IC50
Activity Spreadsheet -- Enzyme Inhibition Constant Data from BindingDB
Found 1 hit for monomerid = 50175093
Trg + Lig
Ki
nM
ΔG°
kcal/mole
IC50
nM
Kd
nM
EC50/IC50
nM
koff
s-1
kon
M-1s-1
pHTemp
°C
Coagulation factor X
(Homo sapiens (Human))
BDBM50175093
((S,Z)-2-(4-chlorobenzoyl)-3-(2-methylbenzofuran-5-...)
Show SMILES Cc1cc2cc(ccc2o1)N=C(N[C@H]1CCCCN(CC(=O)N2CCCC2)C1=O)C(C#N)C(=O)c1ccc(Cl)cc1 |w:10.11|
Show InChI InChI=1S/C31H32ClN5O4/c1-20-16-22-17-24(11-12-27(22)41-20)34-30(25(18-33)29(39)21-7-9-23(32)10-8-21)35-26-6-2-3-15-37(31(26)40)19-28(38)36-13-4-5-14-36/h7-12,16-17,25-26H,2-6,13-15,19H2,1H3,(H,34,35)/t25?,26-/m0/s1
Reactome pathway
n/an/a 13n/an/an/an/an/an/a
Bristol-Myers Squibb Pharmaceutical Research Institute
Curated by ChEMBL
Assay Description
Inhibitory activity against human FXa
Bioorg Med Chem Lett 15: 5453-8 (2005)
Article DOI: 10.1016/j.bmcl.2005.08.107
BindingDB Entry DOI: 10.7270/Q2KH0MW5