BDBM50175100 CHEMBL3809121
SMILES: Cc1cc(C)c(Nc2cc(cc(c2)C(F)(F)F)C(F)(F)F)c(C)c1
InChI Key: InChIKey=UFLGBCWVIPFMCQ-UHFFFAOYSA-N
Data: 2 IC50
Activity Spreadsheet -- Enzyme Inhibition Constant Data from BindingDB
Found 2 hits for monomerid = 50175100
Trg + Lig
Ki
nM
ΔG°
kcal/mole
IC50
nM
Kd
nM
EC50/IC50
nM
koff
s-1
kon
M-1s-1
pHTemp
°C
Rap guanine nucleotide exchange factor 4
(Homo sapiens (Human))
BDBM50175100
(CHEMBL3809121)
Show SMILES Cc1cc(C)c(Nc2cc(cc(c2)C(F)(F)F)C(F)(F)F)c(C)c1
Show InChI InChI=1S/C17H15F6N/c1-9-4-10(2)15(11(3)5-9)24-14-7-12(16(18,19)20)6-13(8-14)17(21,22)23/h4-8,24H,1-3H3
Reactome pathway
n/an/a 1.30E+3n/an/an/an/an/an/a
University of Texas Medical Branch
Curated by ChEMBL
Assay Description
Inhibition of EPAC2 (unknown origin) assessed as reduction in cAMP-mediated guanine nucleotide exchange factor activity in presence of C-terminal tru...
ACS Med Chem Lett 7: 460-4 (2016)
BindingDB Entry DOI: 10.7270/Q2NC6335
Rap guanine nucleotide exchange factor 4
(Homo sapiens (Human))
BDBM50175100
(CHEMBL3809121)
Show SMILES Cc1cc(C)c(Nc2cc(cc(c2)C(F)(F)F)C(F)(F)F)c(C)c1
Show InChI InChI=1S/C17H15F6N/c1-9-4-10(2)15(11(3)5-9)24-14-7-12(16(18,19)20)6-13(8-14)17(21,22)23/h4-8,24H,1-3H3
Reactome pathway
n/an/a 600n/an/an/an/an/an/a
University of Texas Medical Branch
Curated by ChEMBL
Assay Description
Inhibition of 8-NBD-cAMP binding to EPAC2 (unknown origin) by microplate reader analysis
ACS Med Chem Lett 7: 460-4 (2016)
BindingDB Entry DOI: 10.7270/Q2NC6335