BDBM50175296 CHEMBL3809896
SMILES: FC(F)(F)c1cccc(Cn2cnc(c2)-n2ccc(NC(=O)c3cscn3)cc2=O)c1
InChI Key: InChIKey=NFSZBJLXSQDMMY-UHFFFAOYSA-N
Data: 2 IC50
Activity Spreadsheet -- Enzyme Inhibition Constant Data from BindingDB
Found 2 hits for monomerid = 50175296
Trg + Lig
Ki
nM
ΔG°
kcal/mole
IC50
nM
Kd
nM
EC50/IC50
nM
koff
s-1
kon
M-1s-1
pHTemp
°C
Cytochrome P450 2C9
(Homo sapiens (Human))
BDBM50175296
(CHEMBL3809896)
Show SMILES FC(F)(F)c1cccc(Cn2cnc(c2)-n2ccc(NC(=O)c3cscn3)cc2=O)c1
Show InChI InChI=1S/C20H14F3N5O2S/c21-20(22,23)14-3-1-2-13(6-14)8-27-9-17(24-11-27)28-5-4-15(7-18(28)29)26-19(30)16-10-31-12-25-16/h1-7,9-12H,8H2,(H,26,30)
Reactome pathway
n/an/a 2.10E+3n/an/an/an/an/an/a
Boehringer Ingelheim (Canada) Ltd.
Curated by ChEMBL
Assay Description
Inhibition of CYP2C9 (unknown origin)
ACS Med Chem Lett 7: 525-30 (2016)
BindingDB Entry DOI: 10.7270/Q24B337T
Cytochrome P450 3A4
(Homo sapiens (Human))
BDBM50175296
(CHEMBL3809896)
Show SMILES FC(F)(F)c1cccc(Cn2cnc(c2)-n2ccc(NC(=O)c3cscn3)cc2=O)c1
Show InChI InChI=1S/C20H14F3N5O2S/c21-20(22,23)14-3-1-2-13(6-14)8-27-9-17(24-11-27)28-5-4-15(7-18(28)29)26-19(30)16-10-31-12-25-16/h1-7,9-12H,8H2,(H,26,30)
Reactome pathway
n/an/a 1.90E+3n/an/an/an/an/an/a
Boehringer Ingelheim (Canada) Ltd.
Curated by ChEMBL
Assay Description
Inhibition of CYP3A4 (unknown origin)
ACS Med Chem Lett 7: 525-30 (2016)
BindingDB Entry DOI: 10.7270/Q24B337T