BDBM50175339 (4S,7S,11aS)-7-benzamido-N-((3S)-2-hydroxy-5-oxo-tetrahydrofuran-3-yl)-2-(methylsulfonyl)-6-oxo-decahydro-1H-pyrazino[1,2-a]azocine-4-carboxamide::CHEMBL382066
SMILES: CS(=O)(=O)N1C[C@@H]2CCCC[C@H](NC(=O)c3ccccc3)C(=O)N2[C@@H](C1)C(=O)N[C@H]1CC(=O)OC1O
InChI Key: InChIKey=HBVXRUIPTGRFDT-PLCAQUOPSA-N
Data: 3 IC50
Activity Spreadsheet -- Enzyme Inhibition Constant Data from BindingDB
Found 3 hits for monomerid = 50175339
Trg + Lig
Ki
nM
ΔG°
kcal/mole
IC50
nM
Kd
nM
EC50/IC50
nM
koff
s-1
kon
M-1s-1
pHTemp
°C
Caspase-1
(Homo sapiens (Human))
BDBM50175339
((4S,7S,11aS)-7-benzamido-N-((3S)-2-hydroxy-5-oxo-t...)
Show SMILES CS(=O)(=O)N1C[C@@H]2CCCC[C@H](NC(=O)c3ccccc3)C(=O)N2[C@@H](C1)C(=O)N[C@H]1CC(=O)OC1O
Show InChI InChI=1S/C23H30N4O8S/c1-36(33,34)26-12-15-9-5-6-10-16(24-20(29)14-7-3-2-4-8-14)22(31)27(15)18(13-26)21(30)25-17-11-19(28)35-23(17)32/h2-4,7-8,15-18,23,32H,5-6,9-13H2,1H3,(H,24,29)(H,25,30)/t15-,16-,17-,18-,23?/m0/s1
NCI pathway
Reactome pathway
n/an/a 6n/an/an/an/an/an/a
Procter & Gamble Pharmaceuticals, Inc.
Curated by ChEMBL
Assay Description
Inhibitory activity against Caspase 1
Bioorg Med Chem Lett 15: 5434-8 (2005)
Article DOI: 10.1016/j.bmcl.2005.08.109
BindingDB Entry DOI: 10.7270/Q21G0KTJ
Caspase-8
(Homo sapiens (Human))
BDBM50175339
((4S,7S,11aS)-7-benzamido-N-((3S)-2-hydroxy-5-oxo-t...)
Show SMILES CS(=O)(=O)N1C[C@@H]2CCCC[C@H](NC(=O)c3ccccc3)C(=O)N2[C@@H](C1)C(=O)N[C@H]1CC(=O)OC1O
Show InChI InChI=1S/C23H30N4O8S/c1-36(33,34)26-12-15-9-5-6-10-16(24-20(29)14-7-3-2-4-8-14)22(31)27(15)18(13-26)21(30)25-17-11-19(28)35-23(17)32/h2-4,7-8,15-18,23,32H,5-6,9-13H2,1H3,(H,24,29)(H,25,30)/t15-,16-,17-,18-,23?/m0/s1
NCI pathway
Reactome pathway
n/an/a 384n/an/an/an/an/an/a
Procter & Gamble Pharmaceuticals, Inc.
Curated by ChEMBL
Assay Description
Inhibitory activity against Caspase 8
Bioorg Med Chem Lett 15: 5434-8 (2005)
Article DOI: 10.1016/j.bmcl.2005.08.109
BindingDB Entry DOI: 10.7270/Q21G0KTJ
Caspase-3
(Homo sapiens (Human))
BDBM50175339
((4S,7S,11aS)-7-benzamido-N-((3S)-2-hydroxy-5-oxo-t...)
Show SMILES CS(=O)(=O)N1C[C@@H]2CCCC[C@H](NC(=O)c3ccccc3)C(=O)N2[C@@H](C1)C(=O)N[C@H]1CC(=O)OC1O
Show InChI InChI=1S/C23H30N4O8S/c1-36(33,34)26-12-15-9-5-6-10-16(24-20(29)14-7-3-2-4-8-14)22(31)27(15)18(13-26)21(30)25-17-11-19(28)35-23(17)32/h2-4,7-8,15-18,23,32H,5-6,9-13H2,1H3,(H,24,29)(H,25,30)/t15-,16-,17-,18-,23?/m0/s1
NCI pathway
Reactome pathway
n/an/a>1.00E+4n/an/an/an/an/an/a
Procter & Gamble Pharmaceuticals, Inc.
Curated by ChEMBL
Assay Description
Inhibitory activity against Caspase 3
Bioorg Med Chem Lett 15: 5434-8 (2005)
Article DOI: 10.1016/j.bmcl.2005.08.109
BindingDB Entry DOI: 10.7270/Q21G0KTJ