BDBM50175377 2-chloro-6-(((R)-2-((R)-1-hydroxy-2-(2-methyl-1-(naphthalen-2-yl)propan-2-ylamino)ethyl)pyrrolidin-1-yl)methyl)benzonitrile::CHEMBL203479
SMILES: CC(C)(Cc1ccc2ccccc2c1)NC[C@@H](O)[C@H]1CCCN1Cc1cccc(Cl)c1C#N
InChI Key: InChIKey=FZFQYQCKFIOIRD-KAYWLYCHSA-N
Data: 1 IC50
Activity Spreadsheet -- Enzyme Inhibition Constant Data from BindingDB
Found 1 hit for monomerid = 50175377
Trg + Lig
Ki
nM
ΔG°
kcal/mole
IC50
nM
Kd
nM
EC50/IC50
nM
koff
s-1
kon
M-1s-1
pHTemp
°C
Calcium-sensing receptor (CaSR)
(Homo sapiens (Human))
BDBM50175377
(2-chloro-6-(((R)-2-((R)-1-hydroxy-2-(2-methyl-1-(n...)
Show SMILES CC(C)(Cc1ccc2ccccc2c1)NC[C@@H](O)[C@H]1CCCN1Cc1cccc(Cl)c1C#N
Show InChI InChI=1S/C28H32ClN3O/c1-28(2,16-20-12-13-21-7-3-4-8-22(21)15-20)31-18-27(33)26-11-6-14-32(26)19-23-9-5-10-25(29)24(23)17-30/h3-5,7-10,12-13,15,26-27,31,33H,6,11,14,16,18-19H2,1-2H3/t26-,27-/m1/s1
n/an/a 240n/an/an/an/an/an/a
Bristol-Myers Squibb Pharmaceutical Research Institute
Curated by ChEMBL
Assay Description
Inhibition of intracellular calcium release in human TT cells containing calcium-sensing receptor by FLIPR
Bioorg Med Chem Lett 15: 5478-82 (2005)
Article DOI: 10.1016/j.bmcl.2005.08.095
BindingDB Entry DOI: 10.7270/Q2WS8STX