null
SMILES: Fc1ccc(CN(Cc2nncn2Cc2ccc(cc2)C#N)C(=O)c2ccc3ccccc3c2)c(F)c1
InChI Key: InChIKey=VCUKCTLNWUDZBP-UHFFFAOYSA-N
Activity Spreadsheet -- Enzyme Inhibition Constant Data from BindingDB
Found 1 hit for monomerid = 50175395
Trg + Lig
Ki
nM
ΔG°
kcal/mole
IC50
nM
Kd
nM
EC50/IC50
nM
koff
s-1
kon
M-1s-1
pHTemp
°C
Dimer of Protein farnesyltransferase subunit beta
(Homo sapiens (Human))
BDBM50175395
(CHEMBL199965 | N-(2,4-difluorobenzyl)-N-((4-(4-cya...)
Show SMILES Fc1ccc(CN(Cc2nncn2Cc2ccc(cc2)C#N)C(=O)c2ccc3ccccc3c2)c(F)c1
Show InChI InChI=1S/C29H21F2N5O/c30-26-12-11-25(27(31)14-26)17-35(29(37)24-10-9-22-3-1-2-4-23(22)13-24)18-28-34-33-19-36(28)16-21-7-5-20(15-32)6-8-21/h1-14,19H,16-18H2
n/an/a 2.20n/an/an/an/an/an/a
Janssen Research Foundation
Curated by ChEMBL
Assay Description
Inhibitory activity against K-Ras farnesyl transferase
Bioorg Med Chem Lett 15: 5407-11 (2005)
Article DOI: 10.1016/j.bmcl.2005.09.007
BindingDB Entry DOI: 10.7270/Q2S18239