BDBM50175511 CHEMBL95051::MDL-28163::[1-(4-Fluoro-benzyl)-1H-benzoimidazol-2-yl]-{1-[2-(4-methoxy-phenyl)-ethyl]-piperidin-4-yl}-methanone
SMILES: COc1ccc(CCN2CCC(CC2)C(=O)c2nc3ccccc3n2Cc2ccc(F)cc2)cc1
InChI Key: InChIKey=DIPBPGRFGZKMEF-UHFFFAOYSA-N
Data: 7 IC50
Activity Spreadsheet -- Enzyme Inhibition Constant Data from BindingDB
Found 7 hits for monomerid = 50175511
Trg + Lig
Ki
nM
ΔG°
kcal/mole
IC50
nM
Kd
nM
EC50/IC50
nM
koff
s-1
kon
M-1s-1
pHTemp
°C
Neurokinin 1 receptor
(GUINEA PIG)
BDBM50175511
(CHEMBL95051 | MDL-28163 | [1-(4-Fluoro-benzyl)-1H-...)
Show SMILES COc1ccc(CCN2CCC(CC2)C(=O)c2nc3ccccc3n2Cc2ccc(F)cc2)cc1
Show InChI InChI=1S/C29H30FN3O2/c1-35-25-12-8-21(9-13-25)14-17-32-18-15-23(16-19-32)28(34)29-31-26-4-2-3-5-27(26)33(29)20-22-6-10-24(30)11-7-22/h2-13,23H,14-20H2,1H3
n/an/a 5.30n/an/an/an/an/an/a
TBA
Curated by ChEMBL
Assay Description
Antagonistic activity against Tachykinin receptor 1
Bioorg Med Chem Lett 7: 2825-2830 (1997)
Article DOI: 10.1016/S0960-894X(97)10098-1
BindingDB Entry DOI: 10.7270/Q2SF2W50
Histamine H1 receptor
(Homo sapiens (Human))
BDBM50175511
(CHEMBL95051 | MDL-28163 | [1-(4-Fluoro-benzyl)-1H-...)
Show SMILES COc1ccc(CCN2CCC(CC2)C(=O)c2nc3ccccc3n2Cc2ccc(F)cc2)cc1
Show InChI InChI=1S/C29H30FN3O2/c1-35-25-12-8-21(9-13-25)14-17-32-18-15-23(16-19-32)28(34)29-31-26-4-2-3-5-27(26)33(29)20-22-6-10-24(30)11-7-22/h2-13,23H,14-20H2,1H3
Reactome pathway
n/an/a 7.20n/an/an/an/an/an/a
TBA
Curated by ChEMBL
Assay Description
Antagonistic activity against histamine H1 receptor
Bioorg Med Chem Lett 7: 2825-2830 (1997)
Article DOI: 10.1016/S0960-894X(97)10098-1
BindingDB Entry DOI: 10.7270/Q2SF2W50
Neurokinin 2 receptor
(Homo sapiens (Human))
BDBM50175511
(CHEMBL95051 | MDL-28163 | [1-(4-Fluoro-benzyl)-1H-...)
Show SMILES COc1ccc(CCN2CCC(CC2)C(=O)c2nc3ccccc3n2Cc2ccc(F)cc2)cc1
Show InChI InChI=1S/C29H30FN3O2/c1-35-25-12-8-21(9-13-25)14-17-32-18-15-23(16-19-32)28(34)29-31-26-4-2-3-5-27(26)33(29)20-22-6-10-24(30)11-7-22/h2-13,23H,14-20H2,1H3
Reactome pathway
n/an/a 3.39E+3n/an/an/an/an/an/a
TBA
Curated by ChEMBL
Assay Description
Compound was evaluated for the antagonistic activity against Tachykinin receptor 2
Bioorg Med Chem Lett 7: 2819-2824 (1997)
Article DOI: 10.1016/S0960-894X(97)10097-X
BindingDB Entry DOI: 10.7270/Q29S1RJ0
Histamine H1 receptor
(Homo sapiens (Human))
BDBM50175511
(CHEMBL95051 | MDL-28163 | [1-(4-Fluoro-benzyl)-1H-...)
Show SMILES COc1ccc(CCN2CCC(CC2)C(=O)c2nc3ccccc3n2Cc2ccc(F)cc2)cc1
Show InChI InChI=1S/C29H30FN3O2/c1-35-25-12-8-21(9-13-25)14-17-32-18-15-23(16-19-32)28(34)29-31-26-4-2-3-5-27(26)33(29)20-22-6-10-24(30)11-7-22/h2-13,23H,14-20H2,1H3
Reactome pathway
n/an/a 59n/an/an/an/an/an/a
Organon Laboratories
Curated by ChEMBL
Assay Description
Inhibition constant against histamine H1 receptor
J Med Chem 48: 6523-43 (2005)
Article DOI: 10.1021/jm058225d
BindingDB Entry DOI: 10.7270/Q2SF2WZ9
Histamine H1 receptor
(Homo sapiens (Human))
BDBM50175511
(CHEMBL95051 | MDL-28163 | [1-(4-Fluoro-benzyl)-1H-...)
Show SMILES COc1ccc(CCN2CCC(CC2)C(=O)c2nc3ccccc3n2Cc2ccc(F)cc2)cc1
Show InChI InChI=1S/C29H30FN3O2/c1-35-25-12-8-21(9-13-25)14-17-32-18-15-23(16-19-32)28(34)29-31-26-4-2-3-5-27(26)33(29)20-22-6-10-24(30)11-7-22/h2-13,23H,14-20H2,1H3
Reactome pathway
n/an/a 59n/an/an/an/an/an/a
TBA
Curated by ChEMBL
Assay Description
Compound was evaluated for the antagonistic activity against H1 receptor
Bioorg Med Chem Lett 7: 2819-2824 (1997)
Article DOI: 10.1016/S0960-894X(97)10097-X
BindingDB Entry DOI: 10.7270/Q29S1RJ0
Neurokinin 1 receptor
(Homo sapiens (Human))
BDBM50175511
(CHEMBL95051 | MDL-28163 | [1-(4-Fluoro-benzyl)-1H-...)
Show SMILES COc1ccc(CCN2CCC(CC2)C(=O)c2nc3ccccc3n2Cc2ccc(F)cc2)cc1
Show InChI InChI=1S/C29H30FN3O2/c1-35-25-12-8-21(9-13-25)14-17-32-18-15-23(16-19-32)28(34)29-31-26-4-2-3-5-27(26)33(29)20-22-6-10-24(30)11-7-22/h2-13,23H,14-20H2,1H3
Reactome pathway
n/an/a 5.20E+3n/an/an/an/an/an/a
Organon Laboratories
Curated by ChEMBL
Assay Description
Inhibitory concentration against neurokinin NK1 receptor
J Med Chem 48: 6523-43 (2005)
Article DOI: 10.1021/jm058225d
BindingDB Entry DOI: 10.7270/Q2SF2WZ9
Neurokinin 1 receptor
(Homo sapiens (Human))
BDBM50175511
(CHEMBL95051 | MDL-28163 | [1-(4-Fluoro-benzyl)-1H-...)
Show SMILES COc1ccc(CCN2CCC(CC2)C(=O)c2nc3ccccc3n2Cc2ccc(F)cc2)cc1
Show InChI InChI=1S/C29H30FN3O2/c1-35-25-12-8-21(9-13-25)14-17-32-18-15-23(16-19-32)28(34)29-31-26-4-2-3-5-27(26)33(29)20-22-6-10-24(30)11-7-22/h2-13,23H,14-20H2,1H3
Reactome pathway
n/an/a 5.20E+3n/an/an/an/an/an/a
TBA
Curated by ChEMBL
Assay Description
Compound was evaluated for the antagonistic activity against NK1 receptor
Bioorg Med Chem Lett 7: 2819-2824 (1997)
Article DOI: 10.1016/S0960-894X(97)10097-X
BindingDB Entry DOI: 10.7270/Q29S1RJ0