BDBM50175617 2-{3-[4-Amino-9-(tert-butyl-dimethyl-silanyloxy)-6-(tert-butyl-dimethyl-silanyloxymethyl)-2,2-dioxo-1,7-dioxa-2lambda*6*-thia-spiro[4.4]non-3-en-8-yl]-5-methyl-2,6-dioxo-3,6-dihydro-2H-pyrimidin-1-yl}-acetamide::BDBM50192303::CHEMBL379493
SMILES: Cc1cn([C@@H]2O[C@H](CO[Si](C)(C)C(C)(C)C)[C@@]3(OS(=O)(=O)C=C3N)[C@H]2O[Si](C)(C)C(C)(C)C)c(=O)n(CC(N)=O)c1=O
InChI Key: InChIKey=VTMUJIZCPIPIDI-UHFFFAOYSA-N
Data: 3 IC50
Activity Spreadsheet -- Enzyme Inhibition Constant Data from BindingDB
Found 3 hits for monomerid = 50175617
Trg + Lig
Ki
nM
ΔG°
kcal/mole
IC50
nM
Kd
nM
EC50/IC50
nM
koff
s-1
kon
M-1s-1
pHTemp
°C
Human immunodeficiency virus type 1 reverse transcriptase
(Human immunodeficiency virus 1)
BDBM50175617
(2-{3-[4-Amino-9-(tert-butyl-dimethyl-silanyloxy)-6...)
Show SMILES Cc1cn([C@@H]2O[C@H](CO[Si](C)(C)C(C)(C)C)[C@@]3(OS(=O)(=O)C=C3N)[C@H]2O[Si](C)(C)C(C)(C)C)c(=O)n(CC(N)=O)c1=O |c:21|
Show InChI InChI=1S/C26H46N4O9SSi2/c1-16-12-30(23(33)29(21(16)32)13-19(28)31)22-20(38-42(10,11)25(5,6)7)26(17(27)15-40(34,35)39-26)18(37-22)14-36-41(8,9)24(2,3)4/h12,15,18,20,22H,13-14,27H2,1-11H3,(H2,28,31)
n/an/a 1.70E+3n/an/an/an/an/an/a
University of Pittsburgh School of Medicine
Curated by ChEMBL
Assay Description
Inhibition of HIV1 reverse transcriptase RNA-dependent DNA polymerase activity
J Med Chem 49: 4834-41 (2006)
Article DOI: 10.1021/jm0604575
BindingDB Entry DOI: 10.7270/Q2GH9HKC
Human immunodeficiency virus type 1 reverse transcriptase
(Human immunodeficiency virus 1)
BDBM50175617
(2-{3-[4-Amino-9-(tert-butyl-dimethyl-silanyloxy)-6...)
Show SMILES Cc1cn([C@@H]2O[C@H](CO[Si](C)(C)C(C)(C)C)[C@@]3(OS(=O)(=O)C=C3N)[C@H]2O[Si](C)(C)C(C)(C)C)c(=O)n(CC(N)=O)c1=O |c:21|
Show InChI InChI=1S/C26H46N4O9SSi2/c1-16-12-30(23(33)29(21(16)32)13-19(28)31)22-20(38-42(10,11)25(5,6)7)26(17(27)15-40(34,35)39-26)18(37-22)14-36-41(8,9)24(2,3)4/h12,15,18,20,22H,13-14,27H2,1-11H3,(H2,28,31)
n/an/a>2.50E+5n/an/an/an/an/an/a
Instituto de Química Médica (C.S.I.C.)
Curated by ChEMBL
Assay Description
Inhibitory concentration required to inhibit recombinant HIV-1 reverse transcriptase
J Med Chem 48: 6653-60 (2005)
Article DOI: 10.1021/jm050437n
BindingDB Entry DOI: 10.7270/Q2VT1RP3
Human immunodeficiency virus type 1 reverse transcriptase
(Human immunodeficiency virus 1)
BDBM50175617
(2-{3-[4-Amino-9-(tert-butyl-dimethyl-silanyloxy)-6...)
Show SMILES Cc1cn([C@@H]2O[C@H](CO[Si](C)(C)C(C)(C)C)[C@@]3(OS(=O)(=O)C=C3N)[C@H]2O[Si](C)(C)C(C)(C)C)c(=O)n(CC(N)=O)c1=O |c:21|
Show InChI InChI=1S/C26H46N4O9SSi2/c1-16-12-30(23(33)29(21(16)32)13-19(28)31)22-20(38-42(10,11)25(5,6)7)26(17(27)15-40(34,35)39-26)18(37-22)14-36-41(8,9)24(2,3)4/h12,15,18,20,22H,13-14,27H2,1-11H3,(H2,28,31)
n/an/a 7.00E+3n/an/an/an/an/an/a
University of Pittsburgh School of Medicine
Curated by ChEMBL
Assay Description
Inhibition of FLAG-p66/HIS-p51-mediated HIV1 reverse transcriptase dimerization
J Med Chem 49: 4834-41 (2006)
Article DOI: 10.1021/jm0604575
BindingDB Entry DOI: 10.7270/Q2GH9HKC