BDBM50175697 (4-(4-(5-(3-amino-3-methylbut-1-ynyl)thiophen-2-yl)pyrimidin-2-ylamino)phenyl)(4-(pyrrolidin-1-yl)piperidin-1-yl)methanone::CHEMBL381041
SMILES: CC(C)(N)C#Cc1ccc(s1)-c1ccnc(Nc2ccc(cc2)C(=O)N2CCC(CC2)N2CCCC2)n1
InChI Key: InChIKey=WHJZGZLLYCQKOO-UHFFFAOYSA-N
Data: 3 IC50
Activity Spreadsheet -- Enzyme Inhibition Constant Data from BindingDB
Found 3 hits for monomerid = 50175697
Trg + Lig
Ki
nM
ΔG°
kcal/mole
IC50
nM
Kd
nM
EC50/IC50
nM
koff
s-1
kon
M-1s-1
pHTemp
°C
I-kappa-B Kinase 1 (IKK-alpha)/I-kappa-B Kinase 2 (IKK-beta)/NF-kappa-B essential modulator
(Homo sapiens (Human))
BDBM50175697
((4-(4-(5-(3-amino-3-methylbut-1-ynyl)thiophen-2-yl...)
Show SMILES CC(C)(N)C#Cc1ccc(s1)-c1ccnc(Nc2ccc(cc2)C(=O)N2CCC(CC2)N2CCCC2)n1
Show InChI InChI=1S/C29H34N6OS/c1-29(2,30)15-11-24-9-10-26(37-24)25-12-16-31-28(33-25)32-22-7-5-21(6-8-22)27(36)35-19-13-23(14-20-35)34-17-3-4-18-34/h5-10,12,16,23H,3-4,13-14,17-20,30H2,1-2H3,(H,31,32,33)
n/an/a 2n/an/an/an/an/an/a
Novartis Institutes for BioMedical Research
Curated by ChEMBL
Assay Description
Inhibitory activity against IKK complex isolated from HeLa cells
Bioorg Med Chem Lett 16: 108-12 (2005)
Article DOI: 10.1016/j.bmcl.2005.09.035
BindingDB Entry DOI: 10.7270/Q2BR8RQV
Inhibitor of nuclear factor kappa-B kinase subunit beta
(Homo sapiens (Human))
BDBM50175697
((4-(4-(5-(3-amino-3-methylbut-1-ynyl)thiophen-2-yl...)
Show SMILES CC(C)(N)C#Cc1ccc(s1)-c1ccnc(Nc2ccc(cc2)C(=O)N2CCC(CC2)N2CCCC2)n1
Show InChI InChI=1S/C29H34N6OS/c1-29(2,30)15-11-24-9-10-26(37-24)25-12-16-31-28(33-25)32-22-7-5-21(6-8-22)27(36)35-19-13-23(14-20-35)34-17-3-4-18-34/h5-10,12,16,23H,3-4,13-14,17-20,30H2,1-2H3,(H,31,32,33)
NCI pathway
Reactome pathway
n/an/a 15n/an/an/an/an/an/a
Novartis Institutes for BioMedical Research
Curated by ChEMBL
Assay Description
Inhibitory activity against IKK2
Bioorg Med Chem Lett 16: 108-12 (2005)
Article DOI: 10.1016/j.bmcl.2005.09.035
BindingDB Entry DOI: 10.7270/Q2BR8RQV
Inhibitor of nuclear factor kappa-B kinase subunit alpha
(Homo sapiens (Human))
BDBM50175697
((4-(4-(5-(3-amino-3-methylbut-1-ynyl)thiophen-2-yl...)
Show SMILES CC(C)(N)C#Cc1ccc(s1)-c1ccnc(Nc2ccc(cc2)C(=O)N2CCC(CC2)N2CCCC2)n1
Show InChI InChI=1S/C29H34N6OS/c1-29(2,30)15-11-24-9-10-26(37-24)25-12-16-31-28(33-25)32-22-7-5-21(6-8-22)27(36)35-19-13-23(14-20-35)34-17-3-4-18-34/h5-10,12,16,23H,3-4,13-14,17-20,30H2,1-2H3,(H,31,32,33)
Reactome pathway
n/an/a 5n/an/an/an/an/an/a
Novartis Institutes for BioMedical Research
Curated by ChEMBL
Assay Description
Inhibitory activity against IKK1
Bioorg Med Chem Lett 16: 108-12 (2005)
Article DOI: 10.1016/j.bmcl.2005.09.035
BindingDB Entry DOI: 10.7270/Q2BR8RQV