BDBM50175777 2-(3-amino-5-(2-phenylH-pyrazolo[1,5-a]pyridin-3-yl)-1H-pyrazolo[3,4-c]pyridazin-1-yl)ethanol::CHEMBL369976
SMILES: Nc1nn(CCO)c2nnc(cc12)-c1c(nn2ccccc12)-c1ccccc1
InChI Key: InChIKey=QDJYBXSEKNYKGS-UHFFFAOYSA-N
Data: 1 IC50
Activity Spreadsheet -- Enzyme Inhibition Constant Data from BindingDB
Found 1 hit for monomerid = 50175777
Trg + Lig
Ki
nM
ΔG°
kcal/mole
IC50
nM
Kd
nM
EC50/IC50
nM
koff
s-1
kon
M-1s-1
pHTemp
°C
Mitogen-activated protein kinase 1
(Homo sapiens (Human))
BDBM50175777
(2-(3-amino-5-(2-phenylH-pyrazolo[1,5-a]pyridin-3-y...)
Show SMILES Nc1nn(CCO)c2nnc(cc12)-c1c(nn2ccccc12)-c1ccccc1
Show InChI InChI=1S/C20H17N7O/c21-19-14-12-15(22-23-20(14)27(25-19)10-11-28)17-16-8-4-5-9-26(16)24-18(17)13-6-2-1-3-7-13/h1-9,12,28H,10-11H2,(H2,21,25)
NCI pathway
Reactome pathway
n/an/a 5.10E+3n/an/an/an/an/an/a
Fujisawa Pharmaceutical Co., Ltd
Curated by ChEMBL
Assay Description
Inhibitory activity against human ERK2
Bioorg Med Chem Lett 16: 55-8 (2005)
Article DOI: 10.1016/j.bmcl.2005.09.055
BindingDB Entry DOI: 10.7270/Q2Q23ZSV