BDBM50175827 4-((1H-imidazol-4-yl)methyl)-1-heptylpiperidine::CHEMBL424847
SMILES: CCCCCCCN1CCC(Cc2cnc[nH]2)CC1
InChI Key: InChIKey=PKTDABXMBJERIM-UHFFFAOYSA-N
Data: 1 KI  1 Kd
Activity Spreadsheet -- Enzyme Inhibition Constant Data from BindingDB
Found 2 hits for monomerid = 50175827
Trg + Lig
Ki
nM
ΔG°
kcal/mole
IC50
nM
Kd
nM
EC50/IC50
nM
koff
s-1
kon
M-1s-1
pHTemp
°C
HRH3
(GUINEA PIG)
BDBM50175827
(4-((1H-imidazol-4-yl)methyl)-1-heptylpiperidine | ...)
Show SMILES CCCCCCCN1CCC(Cc2cnc[nH]2)CC1
Show InChI InChI=1S/C16H29N3/c1-2-3-4-5-6-9-19-10-7-15(8-11-19)12-16-13-17-14-18-16/h13-15H,2-12H2,1H3,(H,17,18)
2n/an/an/an/an/an/an/an/a
The Schering Plough Research Institute
Curated by ChEMBL
Assay Description
Displacement of [3H]-N-alpha-methylhistamine from histamine H3 receptor in guinea pig brain
Bioorg Med Chem Lett 16: 395-9 (2005)
Article DOI: 10.1016/j.bmcl.2005.09.076
BindingDB Entry DOI: 10.7270/Q29S1QK1
HRH3
(GUINEA PIG)
BDBM50175827
(4-((1H-imidazol-4-yl)methyl)-1-heptylpiperidine | ...)
Show SMILES CCCCCCCN1CCC(Cc2cnc[nH]2)CC1
Show InChI InChI=1S/C16H29N3/c1-2-3-4-5-6-9-19-10-7-15(8-11-19)12-16-13-17-14-18-16/h13-15H,2-12H2,1H3,(H,17,18)
n/an/an/a 2.51n/an/an/an/an/a
The Schering Plough Research Institute
Curated by ChEMBL
Assay Description
Antagonist potency against histamine H3 receptor in an electrically stimulated guinea pig ileum
Bioorg Med Chem Lett 16: 395-9 (2005)
Article DOI: 10.1016/j.bmcl.2005.09.076
BindingDB Entry DOI: 10.7270/Q29S1QK1