BDBM50176337 5-(2-phenyl-5-(pyridin-4-yl)-1H-imidazol-4-yl)-2,3-dihydroinden-1-one oxime::CHEMBL372543
SMILES: O=NC1CCc2cc(ccc12)-c1[nH]c(nc1-c1ccncc1)-c1ccccc1
InChI Key: InChIKey=XMKOUZLRNYKHIU-UHFFFAOYSA-N
Data: 1 Kd
Activity Spreadsheet -- Enzyme Inhibition Constant Data from BindingDB
Found 1 hit for monomerid = 50176337
Trg + Lig
Ki
nM
ΔG°
kcal/mole
IC50
nM
Kd
nM
EC50/IC50
nM
koff
s-1
kon
M-1s-1
pHTemp
°C
Serine/threonine-protein kinase B-raf
(Homo sapiens (Human))
BDBM50176337
(5-(2-phenyl-5-(pyridin-4-yl)-1H-imidazol-4-yl)-2,3...)
Show SMILES O=NC1CCc2cc(ccc12)-c1[nH]c(nc1-c1ccncc1)-c1ccccc1
Show InChI InChI=1S/C23H18N4O/c28-27-20-9-7-17-14-18(6-8-19(17)20)22-21(15-10-12-24-13-11-15)25-23(26-22)16-4-2-1-3-5-16/h1-6,8,10-14,20H,7,9H2,(H,25,26)
NCI pathway
Reactome pathway
n/an/an/a 1.30n/an/an/an/an/a
GlaxoSmithKline Pharmaceuticals
Curated by ChEMBL
Assay Description
Binding affinity at bRaf kinase in fluorescent ligand displacement assay
Bioorg Med Chem Lett 16: 378-81 (2005)
Article DOI: 10.1016/j.bmcl.2005.09.072
BindingDB Entry DOI: 10.7270/Q2Z038Z9